null
SMILES: CCCCCCCCOc1cccc(CNC(=O)\C=C(/O)C(O)=O)c1
InChI Key: InChIKey=NOHHRWQGRVGPMS-LGMDPLHJSA-N
Activity Spreadsheet -- Enzyme Inhibition Constant Data from BindingDB
Found 1 hit for monomerid = 153335
Trg + Lig
Ki
nM
ΔG°
kcal/mole
IC50
nM
Kd
nM
EC50/IC50
nM
koff
s-1
kon
M-1s-1
pHTemp
°C
Decaprenyl diphosphate synthase
(Mycobacterium tuberculosis H37Rv)
BDBM153335
(BPH-1305)
Show SMILES CCCCCCCCOc1cccc(CNC(=O)\C=C(/O)C(O)=O)c1
Show InChI InChI=1S/C19H27NO5/c1-2-3-4-5-6-7-11-25-16-10-8-9-15(12-16)14-20-18(22)13-17(21)19(23)24/h8-10,12-13,21H,2-7,11,14H2,1H3,(H,20,22)(H,23,24)/b17-13-
n/an/a 6.30E+3n/an/an/an/a7.5n/a
University of California San Diego
Assay Description
We screened an in-house library of 43 compounds using GPP as substrate. Briefly, the condensation of IPP and GPP, FPP, or cis-FPP catalyzed by DPPS w...
Chem Biol Drug Des 85: 756-69 (2015)
Article DOI: 10.1111/cbdd.12463
BindingDB Entry DOI: 10.7270/Q2ZG6QZN