BDBM153999 US8999981, F55
SMILES: COc1ccc(nc1)C(=O)Nc1n[nH]c2c1CN(C(=O)N1C[C@@H](C)N(C[C@@H]1C)C1CCOCC1)C2(C)C
InChI Key:
Data: 1 KI
Activity Spreadsheet -- Enzyme Inhibition Constant Data from BindingDB
Found 1 hit for monomerid = 153999
Trg + Lig
Ki
nM
ΔG°
kcal/mole
IC50
nM
Kd
nM
EC50/IC50
nM
koff
s-1
kon
M-1s-1
pHTemp
°C
PKC alpha and beta-2
(Homo sapiens (Human))
BDBM153999
(US8999981, F55)
Show SMILES COc1ccc(nc1)C(=O)Nc1n[nH]c2c1CN(C(=O)N1C[C@@H](C)N(C[C@@H]1C)C1CCOCC1)C2(C)C |r|
NCI pathway
Reactome pathway
US Patent
<10<-11.1n/an/an/an/an/a7.430
Pfizer Inc.; Pfizer Products Inc.
US Patent
Assay Description
Protein Kinase C beta 2 (PKC beta II) catalyzes the production of ADP from ATP that accompanies the phosphoryl transfer to the PKC Pseudosubstrate pe...
US Patent US8999981 (2015)
BindingDB Entry DOI: 10.7270/Q2RR1X0K