BDBM154612 US8999957, Column 165-167, Compound 1
SMILES: COc1cccc(F)c1CN1C[C@@H](CC[C@H]1C(=O)NOCC1CC1)NC(=O)c1ccc2[nH]nc(-c3ccnc(C)c3)c2c1
InChI Key:
Data: 1 IC50
Activity Spreadsheet -- Enzyme Inhibition Constant Data from BindingDB
Found 1 hit for monomerid = 154612
Trg + Lig
Ki
nM
ΔG°
kcal/mole
IC50
nM
Kd
nM
EC50/IC50
nM
koff
s-1
kon
M-1s-1
pHTemp
°C
Mitogen-activated protein kinase 1
(Mus musculus (Mouse))
BDBM154612
(US8999957, Column 165-167, Compound 1)
Show SMILES COc1cccc(F)c1CN1C[C@@H](CC[C@H]1C(=O)NOCC1CC1)NC(=O)c1ccc2[nH]nc(-c3ccnc(C)c3)c2c1 |r|
Reactome pathway
US Patent
n/an/a 0.600n/an/an/an/an/an/a
Merck Sharp & Dohme Corp.
US Patent
Assay Description
Condition 2: Activated ERK2 activity was determined in an IMAP-FP assay (Molecular Devices). Using this assay format, the potency (IC50) of each comp...
US Patent US8999957 (2015)
BindingDB Entry DOI: 10.7270/Q2GB22S9