BDBM154822 US8999957, Table 3, Compound 94
SMILES: COc1cccc(F)c1CN1C[C@@H](CC[C@H]1C(N)=O)NC(=O)c1ccc2[nH]nc(-c3ccncc3)c2c1
InChI Key:
Data: 1 IC50
Activity Spreadsheet -- Enzyme Inhibition Constant Data from BindingDB
Found 1 hit for monomerid = 154822
Trg + Lig
Ki
nM
ΔG°
kcal/mole
IC50
nM
Kd
nM
EC50/IC50
nM
koff
s-1
kon
M-1s-1
pHTemp
°C
Mitogen-activated protein kinase 1
(Mus musculus (Mouse))
BDBM154822
(US8999957, Table 3, Compound 94)
Show SMILES COc1cccc(F)c1CN1C[C@@H](CC[C@H]1C(N)=O)NC(=O)c1ccc2[nH]nc(-c3ccncc3)c2c1 |r|
Reactome pathway
US Patent
n/an/a 1.70n/an/an/an/an/an/a
Merck Sharp & Dohme Corp.
US Patent
Assay Description
Condition 1: Activated ERK2 activity was also determined in the IMAP assay format using the procedure outlined above. 1 μl of 25× compound was a...
US Patent US8999957 (2015)
BindingDB Entry DOI: 10.7270/Q2GB22S9