BDBM154873 US8999957, Table 3, Compound 146
SMILES: CNC(=O)[C@@H]1CC[C@H](CN1Cc1c(F)cccc1OC)NC(=O)c1ccc2[nH]nc(-c3ccnc(C)c3)c2c1
InChI Key:
Data: 1 IC50
Activity Spreadsheet -- Enzyme Inhibition Constant Data from BindingDB
Found 1 hit for monomerid = 154873
Trg + Lig
Ki
nM
ΔG°
kcal/mole
IC50
nM
Kd
nM
EC50/IC50
nM
koff
s-1
kon
M-1s-1
pHTemp
°C
Mitogen-activated protein kinase 1
(Mus musculus (Mouse))
BDBM154873
(US8999957, Table 3, Compound 146)
Show SMILES CNC(=O)[C@@H]1CC[C@H](CN1Cc1c(F)cccc1OC)NC(=O)c1ccc2[nH]nc(-c3ccnc(C)c3)c2c1 |r|
Reactome pathway
US Patent
n/an/a 2.70n/an/an/an/an/an/a
Merck Sharp & Dohme Corp.
US Patent
Assay Description
Condition 1: Activated ERK2 activity was also determined in the IMAP assay format using the procedure outlined above. 1 μl of 25× compound was a...
US Patent US8999957 (2015)
BindingDB Entry DOI: 10.7270/Q2GB22S9