BDBM155140 US9000184, 10, isomer 1
SMILES:
InChI Key: InChIKey=RDZDAKHZWXGMEB-UHFFFAOYSA-N
Data: 2 IC50
Activity Spreadsheet -- Enzyme Inhibition Constant Data from BindingDB
Found 2 hits for monomerid = 155140
Trg + Lig
Ki
nM
ΔG°
kcal/mole
IC50
nM
Kd
nM
EC50/IC50
nM
koff
s-1
kon
M-1s-1
pHTemp
°C
Beta amyloid A4 protein
(Homo sapiens (Human))
BDBM155140
(US9000184, 10, isomer 1)
Show InChI InChI=1S/C26H27ClN4O/c1-16-24(29)31-26(30-16)23-14-19(20-11-17(15-28)12-21(27)13-20)4-3-18(23)5-8-25(26)9-6-22(32-2)7-10-25/h3-4,11-14,22H,5-10H2,1-2H3,(H2,29,31)
Reactome pathway
US Patent
n/an/a 3.10n/an/an/an/an/a37
AstraZeneca AB
US Patent
Assay Description
SH-SY5Y cells were cultured in DMEM/F-12 with Glutamax, 10% FCS and 1% non-essential amino acids and cryopreserved and stored at -140 C. at a concent...
US Patent US9000184 (2015)
BindingDB Entry DOI: 10.7270/Q2K35SDQ
Beta-secretase 1
(Homo sapiens (Human))
BDBM155140
(US9000184, 10, isomer 1)
Show InChI InChI=1S/C26H27ClN4O/c1-16-24(29)31-26(30-16)23-14-19(20-11-17(15-28)12-21(27)13-20)4-3-18(23)5-8-25(26)9-6-22(32-2)7-10-25/h3-4,11-14,22H,5-10H2,1-2H3,(H2,29,31)
US Patent
n/an/a 5.70n/an/an/an/a2.5n/a
AstraZeneca AB
US Patent
Assay Description
TR-FRET Assay: The beta -secretase enzyme used in the TR-FRET is prepared as follows:The cDNA for the soluble part of the human beta -Secretase (AA 1...
US Patent US9000184 (2015)
BindingDB Entry DOI: 10.7270/Q2K35SDQ