BDBM155378 US9006282, Example 2, Compound 6::US9102656, Example 2, Compound 6
SMILES: CC(C)c1nc(nc(-c2ccc(F)cc2)c1\C=C\[C@@H]1C[C@H](CC(OCC=C)O1)OCc1ccccc1)N(C)S(C)(=O)=O
InChI Key: InChIKey=OMFUKTXBDFLJRM-FJAMEXCJSA-N
Data: 2 IC50
Activity Spreadsheet -- Enzyme Inhibition Constant Data from BindingDB
Found 2 hits for monomerid = 155378
Trg + Lig
Ki
nM
ΔG°
kcal/mole
IC50
nM
Kd
nM
EC50/IC50
nM
koff
s-1
kon
M-1s-1
pHTemp
°C
3-hydroxy-3-methylglutaryl-coenzyme A reductase (HMG-CoA)
(Homo sapiens (Human))
BDBM155378
(US9006282, Example 2, Compound 6 | US9102656, Exam...)
Show SMILES CC(C)c1nc(nc(-c2ccc(F)cc2)c1\C=C\[C@@H]1C[C@H](CC(OCC=C)O1)OCc1ccccc1)N(C)S(C)(=O)=O |r|
Show InChI InChI=1S/C32H38FN3O5S/c1-6-18-39-29-20-27(40-21-23-10-8-7-9-11-23)19-26(41-29)16-17-28-30(22(2)3)34-32(36(4)42(5,37)38)35-31(28)24-12-14-25(33)15-13-24/h6-17,22,26-27,29H,1,18-21H2,2-5H3/b17-16+/t26-,27-,29?/m1/s1
US Patent
n/an/a 3n/an/an/an/an/an/a
RedX Pharma Limited
US Patent
Assay Description
The following procedure was followed using a HMG-CoA Reductase assay kit obtained from Sigma-Aldrich (catalogue number CS1090). The assay is based on...
US Patent US9102656 (2015)
BindingDB Entry DOI: 10.7270/Q2G15ZMV
HMG-CoA reductase
(Rattus norvegicus (rat))
BDBM155378
(US9006282, Example 2, Compound 6 | US9102656, Exam...)
Show SMILES CC(C)c1nc(nc(-c2ccc(F)cc2)c1\C=C\[C@@H]1C[C@H](CC(OCC=C)O1)OCc1ccccc1)N(C)S(C)(=O)=O |r|
Show InChI InChI=1S/C32H38FN3O5S/c1-6-18-39-29-20-27(40-21-23-10-8-7-9-11-23)19-26(41-29)16-17-28-30(22(2)3)34-32(36(4)42(5,37)38)35-31(28)24-12-14-25(33)15-13-24/h6-17,22,26-27,29H,1,18-21H2,2-5H3/b17-16+/t26-,27-,29?/m1/s1
Reactome pathway
US Patent
n/an/a 3n/an/an/an/a7.2n/a
Redx Pharma Limited
US Patent
Assay Description
All assays were carried out in a reaction buffer containing 100 nM KxPO4 at pH 7.2, 1 mM EDTA, 500 mM KCl and 1 mg/ml BSA. The concentrations of NADP...
US Patent US9006282 (2015)
BindingDB Entry DOI: 10.7270/Q28K77T8