BDBM1558 2-ethyl-9-methyl-5-(1,3-thiazol-5-yl)-2,4,9,15-tetraazatricyclo[9.4.0.0^{3,8}]pentadeca-1(11),3,5,7,12,14-hexaen-10-one::Dipyridodiazepinone deriv. 47
SMILES: CCN1c2nc(ccc2N(C)C(=O)c2cccnc12)-c1cncs1
InChI Key: InChIKey=JFVMTILABAYJGC-UHFFFAOYSA-N
Data: 2 IC50
Activity Spreadsheet -- Enzyme Inhibition Constant Data from BindingDB
Found 2 hits for monomerid = 1558
Trg + Lig
Ki
nM
ΔG°
kcal/mole
IC50
nM
Kd
nM
EC50/IC50
nM
koff
s-1
kon
M-1s-1
pHTemp
°C
HIV-1 Reverse Transcriptase Mutant (Y181C)
(Human immunodeficiency virus type 1)
BDBM1558
(2-ethyl-9-methyl-5-(1,3-thiazol-5-yl)-2,4,9,15-tet...)
Show SMILES CCN1c2nc(ccc2N(C)C(=O)c2cccnc12)-c1cncs1
Show InChI InChI=1S/C17H15N5OS/c1-3-22-15-11(5-4-8-19-15)17(23)21(2)13-7-6-12(20-16(13)22)14-9-18-10-24-14/h4-10H,3H2,1-2H3
n/an/a 240n/an/an/an/an/an/a
Boehringer Ingelheim Pharmaceuticals Inc.
Assay Description
The IC50 of reverse transcriptase is the concentration that inhibits 50% of recombinant HIV-1 RT RNA-directed DNA polymerase activity in vitro.
J Med Chem 38: 4830-8 (1995)
Article DOI: 10.1021/jm00024a010
BindingDB Entry DOI: 10.7270/Q23B5XBJ
HIV-1 Reverse Transcriptase
(Human immunodeficiency virus type 1)
BDBM1558
(2-ethyl-9-methyl-5-(1,3-thiazol-5-yl)-2,4,9,15-tet...)
Show SMILES CCN1c2nc(ccc2N(C)C(=O)c2cccnc12)-c1cncs1
Show InChI InChI=1S/C17H15N5OS/c1-3-22-15-11(5-4-8-19-15)17(23)21(2)13-7-6-12(20-16(13)22)14-9-18-10-24-14/h4-10H,3H2,1-2H3
n/an/a 100n/an/an/an/an/an/a
Boehringer Ingelheim Pharmaceuticals Inc.
Assay Description
The IC50 of reverse transcriptase is the concentration that inhibits 50% of recombinant HIV-1 RT RNA-directed DNA polymerase activity in vitro.
J Med Chem 38: 4830-8 (1995)
Article DOI: 10.1021/jm00024a010
BindingDB Entry DOI: 10.7270/Q23B5XBJ