BDBM156129 US9018214, 180
SMILES: C[C@@H]1CN(CC(=O)N2CC(C)(C)c3ncc(Cc4ccccc4)cc23)[C@@H](CN2CCCC2=O)CN1
InChI Key: InChIKey=ALAFRPAHGDJVFE-NFBKMPQASA-N
Data: 2 IC50  2 EC50
Activity Spreadsheet -- Enzyme Inhibition Constant Data from BindingDB
Found 4 hits for monomerid = 156129
Trg + Lig
Ki
nM
ΔG°
kcal/mole
IC50
nM
Kd
nM
EC50/IC50
nM
koff
s-1
kon
M-1s-1
pHTemp
°C
X-linked inhibitor of apoptosis protein (XIAP)
(Homo sapiens (Human))
BDBM156129
(US9018214, 180)
Show SMILES C[C@@H]1CN(CC(=O)N2CC(C)(C)c3ncc(Cc4ccccc4)cc23)[C@@H](CN2CCCC2=O)CN1 |r|
Show InChI InChI=1S/C28H37N5O2/c1-20-16-32(23(15-29-20)17-31-11-7-10-25(31)34)18-26(35)33-19-28(2,3)27-24(33)13-22(14-30-27)12-21-8-5-4-6-9-21/h4-6,8-9,13-14,20,23,29H,7,10-12,15-19H2,1-3H3/t20-,23-/m1/s1
US Patent
n/an/a 44n/an/an/an/a7.525
Astex Therapeutics Limited
US Patent
Assay Description
Modified SMAC peptides and compounds were tested for their ability to displace the fluorescent tracer from either XIAP, clAP-1 or clAP-2. BIR3 domain...
US Patent US9018214 (2015)
BindingDB Entry DOI: 10.7270/Q23T9FXQ
Baculoviral IAP repeat-containing protein 2
(Homo sapiens (Human))
BDBM156129
(US9018214, 180)
Show SMILES C[C@@H]1CN(CC(=O)N2CC(C)(C)c3ncc(Cc4ccccc4)cc23)[C@@H](CN2CCCC2=O)CN1 |r|
Show InChI InChI=1S/C28H37N5O2/c1-20-16-32(23(15-29-20)17-31-11-7-10-25(31)34)18-26(35)33-19-28(2,3)27-24(33)13-22(14-30-27)12-21-8-5-4-6-9-21/h4-6,8-9,13-14,20,23,29H,7,10-12,15-19H2,1-3H3/t20-,23-/m1/s1
n/an/an/an/a 7.5n/an/an/an/a
Astex Pharmaceuticals
Curated by ChEMBL
Assay Description
Induction of cIAP1 degradation in human MDA-MB-231 cells after 2 hrs
J Med Chem 60: 4611-4625 (2017)
Article DOI: 10.1021/acs.jmedchem.6b01877
BindingDB Entry DOI: 10.7270/Q2KK9DX7
X-linked inhibitor of apoptosis protein (XIAP)
(Homo sapiens (Human))
BDBM156129
(US9018214, 180)
Show SMILES C[C@@H]1CN(CC(=O)N2CC(C)(C)c3ncc(Cc4ccccc4)cc23)[C@@H](CN2CCCC2=O)CN1 |r|
Show InChI InChI=1S/C28H37N5O2/c1-20-16-32(23(15-29-20)17-31-11-7-10-25(31)34)18-26(35)33-19-28(2,3)27-24(33)13-22(14-30-27)12-21-8-5-4-6-9-21/h4-6,8-9,13-14,20,23,29H,7,10-12,15-19H2,1-3H3/t20-,23-/m1/s1
n/an/a 44n/an/an/an/an/an/a
Astex Pharmaceuticals
Curated by ChEMBL
Assay Description
Inhibition of SMAC-derived peptide abuRPFK (5 and 6FAM)-amide interaction with XIAP BIR3 domain (unknown origin) by fluorescence polarization assay
J Med Chem 60: 4611-4625 (2017)
Article DOI: 10.1021/acs.jmedchem.6b01877
BindingDB Entry DOI: 10.7270/Q2KK9DX7
X-linked inhibitor of apoptosis protein (XIAP)
(Homo sapiens (Human))
BDBM156129
(US9018214, 180)
Show SMILES C[C@@H]1CN(CC(=O)N2CC(C)(C)c3ncc(Cc4ccccc4)cc23)[C@@H](CN2CCCC2=O)CN1 |r|
Show InChI InChI=1S/C28H37N5O2/c1-20-16-32(23(15-29-20)17-31-11-7-10-25(31)34)18-26(35)33-19-28(2,3)27-24(33)13-22(14-30-27)12-21-8-5-4-6-9-21/h4-6,8-9,13-14,20,23,29H,7,10-12,15-19H2,1-3H3/t20-,23-/m1/s1
n/an/an/an/a 120n/an/an/an/a
Astex Pharmaceuticals
Curated by ChEMBL
Assay Description
Inhibition of full length FLAG-tagged XIAP (unknown origin) interaction with full length untagged caspase-9 expressed in HEK293 cells after 2 hrs by ...
J Med Chem 60: 4611-4625 (2017)
Article DOI: 10.1021/acs.jmedchem.6b01877
BindingDB Entry DOI: 10.7270/Q2KK9DX7