null
SMILES: CCOC(=O)CNC(=O)C(CC(C)C)NC(=O)C(=C)COC(=O)c1c(cccc1C(F)(F)F)C(F)(F)F
InChI Key: InChIKey=PIBIRGYHHYAZIQ-UHFFFAOYSA-N
Activity Spreadsheet -- Enzyme Inhibition Constant Data from BindingDB
Found 1 hit for monomerid = 156233
Trg + Lig
Ki
nM
ΔG°
kcal/mole
IC50
nM
Kd
nM
EC50/IC50
nM
koff
s-1
kon
M-1s-1
pHTemp
°C
Thioredoxin reductase 1, cytoplasmic
(Homo sapiens (Human))
BDBM156233
(US9018255, 3a)
Show SMILES CCOC(=O)CNC(=O)C(CC(C)C)NC(=O)C(=C)COC(=O)c1c(cccc1C(F)(F)F)C(F)(F)F
Show InChI InChI=1S/C23H26F6N2O6/c1-5-36-17(32)10-30-20(34)16(9-12(2)3)31-19(33)13(4)11-37-21(35)18-14(22(24,25)26)7-6-8-15(18)23(27,28)29/h6-8,12,16H,4-5,9-11H2,1-3H3,(H,30,34)(H,31,33)
US Patent
n/an/a 3.20E+3n/an/an/an/a7.6n/a
Instytut Chemii Organicznej Polskiej Akademii Nauk; Warszawski Uniwersytet Medyczny
US Patent
Assay Description
The method of determining thioredoxin activity is based on the reduction of insulin by thioredoxin. Thioredoxin is reconstituted is by thioredoxin re...
US Patent US9018255 (2015)
BindingDB Entry DOI: 10.7270/Q2VD6X6N