BDBM15624 N-Benzyl-4-(4-(3-chlorophenyl)-1H-pyrazol-3-yl)-N-methyl-1H-pyrrole-2-carboxamide::N-benzyl-4-[4-(3-chlorophenyl)-1H-pyrazol-3-yl]-N-methyl-1H-pyrrole-2-carboxamide::Pyrrole Carboxamide Analog 5j
SMILES: CN(Cc1ccccc1)C(=O)c1cc(c[nH]1)-c1n[nH]cc1-c1cccc(Cl)c1
InChI Key: InChIKey=HJHGABLTQYNEHT-UHFFFAOYSA-N
Data: 2 KI
PDB links: 2 PDB IDs contain inhibitors having a similarity of 90% to this monomer.
Activity Spreadsheet -- Enzyme Inhibition Constant Data from BindingDB
Found 2 hits for monomerid = 15624
Trg + Lig
Ki
nM
ΔG°
kcal/mole
IC50
nM
Kd
nM
EC50/IC50
nM
koff
s-1
kon
M-1s-1
pHTemp
°C
Mitogen-activated protein kinase 1
(Homo sapiens (Human))
BDBM15624
(N-Benzyl-4-(4-(3-chlorophenyl)-1H-pyrazol-3-yl)-N-...)
Show SMILES CN(Cc1ccccc1)C(=O)c1cc(c[nH]1)-c1n[nH]cc1-c1cccc(Cl)c1
Show InChI InChI=1S/C22H19ClN4O/c1-27(14-15-6-3-2-4-7-15)22(28)20-11-17(12-24-20)21-19(13-25-26-21)16-8-5-9-18(23)10-16/h2-13,24H,14H2,1H3,(H,25,26)
NCI pathway
Reactome pathway
440 -8.81n/an/an/an/an/a7.530
Vertex
Assay Description
A coupled spectrophotometric assay was used in which ADP generated by ERK2 was converted to ATP by pyruvate kinase with the production of pyruvate fr...
J Med Chem 50: 1280-7 (2007)
Article DOI: 10.1021/jm061381f
BindingDB Entry DOI: 10.7270/Q2BR8QFV
Mitogen-activated protein kinase 10
(Homo sapiens (Human))
BDBM15624
(N-Benzyl-4-(4-(3-chlorophenyl)-1H-pyrazol-3-yl)-N-...)
Show SMILES CN(Cc1ccccc1)C(=O)c1cc(c[nH]1)-c1n[nH]cc1-c1cccc(Cl)c1
Show InChI InChI=1S/C22H19ClN4O/c1-27(14-15-6-3-2-4-7-15)22(28)20-11-17(12-24-20)21-19(13-25-26-21)16-8-5-9-18(23)10-16/h2-13,24H,14H2,1H3,(H,25,26)
NCI pathway
Reactome pathway
>4.00E+3n/an/an/an/an/an/an/an/a
Vertex
Assay Description
A coupled spectrophotometric assay was used in which ADP generated by JNK3 was converted to ATP by pyruvate kinase with the production of pyruvate fr...
J Med Chem 50: 1280-7 (2007)
Article DOI: 10.1021/jm061381f
BindingDB Entry DOI: 10.7270/Q2BR8QFV