BDBM1574 5-(6-aminopyridin-3-yl)-2-ethyl-9-methyl-2,4,9,15-tetraazatricyclo[9.4.0.0^{3,8}]pentadeca-1(11),3,5,7,12,14-hexaen-10-one::Dipyridodiazepinone deriv. 67
SMILES: CCN1c2nc(ccc2N(C)C(=O)c2cccnc12)-c1ccc(N)nc1
InChI Key: InChIKey=JEORFMMREVWKES-UHFFFAOYSA-N
Data: 2 IC50
Activity Spreadsheet -- Enzyme Inhibition Constant Data from BindingDB
Found 2 hits for monomerid = 1574
Trg + Lig
Ki
nM
ΔG°
kcal/mole
IC50
nM
Kd
nM
EC50/IC50
nM
koff
s-1
kon
M-1s-1
pHTemp
°C
HIV-1 Reverse Transcriptase Mutant (Y181C)
(Human immunodeficiency virus type 1)
BDBM1574
(5-(6-aminopyridin-3-yl)-2-ethyl-9-methyl-2,4,9,15-...)
Show SMILES CCN1c2nc(ccc2N(C)C(=O)c2cccnc12)-c1ccc(N)nc1
Show InChI InChI=1S/C19H18N6O/c1-3-25-17-13(5-4-10-21-17)19(26)24(2)15-8-7-14(23-18(15)25)12-6-9-16(20)22-11-12/h4-11H,3H2,1-2H3,(H2,20,22)
n/an/a 260n/an/an/an/an/an/a
Boehringer Ingelheim Pharmaceuticals Inc.
Assay Description
The IC50 of reverse transcriptase is the concentration that inhibits 50% of recombinant HIV-1 RT RNA-directed DNA polymerase activity in vitro.
J Med Chem 38: 4830-8 (1995)
Article DOI: 10.1021/jm00024a010
BindingDB Entry DOI: 10.7270/Q23B5XBJ
HIV-1 Reverse Transcriptase
(Human immunodeficiency virus type 1)
BDBM1574
(5-(6-aminopyridin-3-yl)-2-ethyl-9-methyl-2,4,9,15-...)
Show SMILES CCN1c2nc(ccc2N(C)C(=O)c2cccnc12)-c1ccc(N)nc1
Show InChI InChI=1S/C19H18N6O/c1-3-25-17-13(5-4-10-21-17)19(26)24(2)15-8-7-14(23-18(15)25)12-6-9-16(20)22-11-12/h4-11H,3H2,1-2H3,(H2,20,22)
n/an/a 50n/an/an/an/an/an/a
Boehringer Ingelheim Pharmaceuticals Inc.
Assay Description
The IC50 of reverse transcriptase is the concentration that inhibits 50% of recombinant HIV-1 RT RNA-directed DNA polymerase activity in vitro.
J Med Chem 38: 4830-8 (1995)
Article DOI: 10.1021/jm00024a010
BindingDB Entry DOI: 10.7270/Q23B5XBJ