null
SMILES: Nc1c(cnn1-c1ccc(F)cc1F)C(=O)c1cccc(Oc2cccnc2)c1
InChI Key: InChIKey=PERCBPSYBMFECH-UHFFFAOYSA-N
Activity Spreadsheet -- Enzyme Inhibition Constant Data from BindingDB
Found 1 hit for monomerid = 15745
Trg + Lig
Ki
nM
ΔG°
kcal/mole
IC50
nM
Kd
nM
EC50/IC50
nM
koff
s-1
kon
M-1s-1
pHTemp
°C
Mitogen-activated protein kinase 14
(Homo sapiens (Human))
BDBM15745
(1-(2,4-difluorophenyl)-4-{[3-(pyridin-3-yloxy)phen...)
Show SMILES Nc1c(cnn1-c1ccc(F)cc1F)C(=O)c1cccc(Oc2cccnc2)c1
Show InChI InChI=1S/C21H14F2N4O2/c22-14-6-7-19(18(23)10-14)27-21(24)17(12-26-27)20(28)13-3-1-4-15(9-13)29-16-5-2-8-25-11-16/h1-12H,24H2
NCI pathway
Reactome pathway
n/an/a 340n/an/an/an/an/an/a
Roche Palo Alto LLC
Assay Description
Inhibition of human recombinant active p38alpha MAP kinase was tested by measuring the incorporation of 33P from gamma-[33P] ATP into myelin basic pr...
J Med Chem 49: 1562-75 (2006)
Article DOI: 10.1021/jm050736c
BindingDB Entry DOI: 10.7270/Q23776ZN