BDBM15746 2-(3-{[5-amino-1-(4-fluorophenyl)-1H-pyrazol-4-yl]carbonyl}phenyl)ethan-1-ol::5-Amino-1-(4-fluorophenyl)- 4-[3-(2-hydroxyethyl)benzoyl]-pyrazole::aminopyrazole 27
SMILES: Nc1c(cnn1-c1ccc(F)cc1)C(=O)c1cccc(CCO)c1
InChI Key: InChIKey=YNQCAQKAWQPMQN-UHFFFAOYSA-N
Data: 1 IC50
Activity Spreadsheet -- Enzyme Inhibition Constant Data from BindingDB
Found 1 hit for monomerid = 15746
Trg + Lig
Ki
nM
ΔG°
kcal/mole
IC50
nM
Kd
nM
EC50/IC50
nM
koff
s-1
kon
M-1s-1
pHTemp
°C
Mitogen-activated protein kinase 14
(Homo sapiens (Human))
BDBM15746
(2-(3-{[5-amino-1-(4-fluorophenyl)-1H-pyrazol-4-yl]...)
Show SMILES Nc1c(cnn1-c1ccc(F)cc1)C(=O)c1cccc(CCO)c1
Show InChI InChI=1S/C18H16FN3O2/c19-14-4-6-15(7-5-14)22-18(20)16(11-21-22)17(24)13-3-1-2-12(10-13)8-9-23/h1-7,10-11,23H,8-9,20H2
NCI pathway
Reactome pathway
n/an/a 850n/an/an/an/an/an/a
Roche Palo Alto LLC
Assay Description
Inhibition of human recombinant active p38alpha MAP kinase was tested by measuring the incorporation of 33P from gamma-[33P] ATP into myelin basic pr...
J Med Chem 49: 1562-75 (2006)
Article DOI: 10.1021/jm050736c
BindingDB Entry DOI: 10.7270/Q23776ZN