BDBM157600 US9023865, 441
SMILES: Cc1cc(ccn1)-c1n[nH]c2cc(NC(=O)NCc3ccccc3OC(F)F)ncc12
InChI Key: InChIKey=QTFZMCLYDFDLMI-UHFFFAOYSA-N
Data: 1 IC50
Activity Spreadsheet -- Enzyme Inhibition Constant Data from BindingDB
Found 1 hit for monomerid = 157600
Trg + Lig
Ki
nM
ΔG°
kcal/mole
IC50
nM
Kd
nM
EC50/IC50
nM
koff
s-1
kon
M-1s-1
pHTemp
°C
Mitogen-activated protein kinase 1
(Homo sapiens (Human))
BDBM157600
(US9023865, 441)
Show SMILES Cc1cc(ccn1)-c1n[nH]c2cc(NC(=O)NCc3ccccc3OC(F)F)ncc12
Show InChI InChI=1S/C21H18F2N6O2/c1-12-8-13(6-7-24-12)19-15-11-25-18(9-16(15)28-29-19)27-21(30)26-10-14-4-2-3-5-17(14)31-20(22)23/h2-9,11,20H,10H2,1H3,(H,28,29)(H2,25,26,27,30)
NCI pathway
Reactome pathway
US Patent
n/an/a 0.309n/an/an/an/an/an/a
Merck Sharp & Dohme Corp.
US Patent
Assay Description
Activated ERK2 activity was determined in an IMAP-FP assay (Molecular Devices). Using this assay format, the potency (IC50) of each compound was dete...
US Patent US9023865 (2015)
BindingDB Entry DOI: 10.7270/Q2PN94CC