null
SMILES: CC(CO)Nc1cc(ccn1)-c1[nH]c2cccnc2c1-c1ccc(F)cc1
InChI Key: InChIKey=NPHRPHMHAOPRTH-UHFFFAOYSA-N
Activity Spreadsheet -- Enzyme Inhibition Constant Data from BindingDB
Found 1 hit for monomerid = 15776
Trg + Lig
Ki
nM
ΔG°
kcal/mole
IC50
nM
Kd
nM
EC50/IC50
nM
koff
s-1
kon
M-1s-1
pHTemp
°C
Mitogen-activated protein kinase 14
(Homo sapiens (Human))
BDBM15776
(2-({4-[3-(4-fluorophenyl)-1H-pyrrolo[3,2-b]pyridin...)
Show SMILES CC(CO)Nc1cc(ccn1)-c1[nH]c2cccnc2c1-c1ccc(F)cc1
Show InChI InChI=1S/C21H19FN4O/c1-13(12-27)25-18-11-15(8-10-23-18)20-19(14-4-6-16(22)7-5-14)21-17(26-20)3-2-9-24-21/h2-11,13,26-27H,12H2,1H3,(H,23,25)
NCI pathway
Reactome pathway
n/an/a 3n/an/an/an/a7.430
Roche Palo Alto LLC
Assay Description
Inhibition of human recombinant active p38alpha MAP kinase was tested by measuring the incorporation of 33P from gamma-[33P] ATP into myelin basic pr...
J Med Chem 46: 4702-13 (2003)
Article DOI: 10.1021/jm0301787
BindingDB Entry DOI: 10.7270/Q2ZG6QHT