BDBM157772 US9023865, 613
SMILES: COC[C@@H](NC(=O)Nc1cc2[nH]nc(-c3ccc4nn(C)cc4c3)c2cn1)c1ccccc1
InChI Key:
Data: 1 IC50
Activity Spreadsheet -- Enzyme Inhibition Constant Data from BindingDB
Found 1 hit for monomerid = 157772
Trg + Lig
Ki
nM
ΔG°
kcal/mole
IC50
nM
Kd
nM
EC50/IC50
nM
koff
s-1
kon
M-1s-1
pHTemp
°C
Mitogen-activated protein kinase 1
(Homo sapiens (Human))
BDBM157772
(US9023865, 613)
Show SMILES COC[C@@H](NC(=O)Nc1cc2[nH]nc(-c3ccc4nn(C)cc4c3)c2cn1)c1ccccc1 |r|
NCI pathway
Reactome pathway
US Patent
n/an/a 0.297n/an/an/an/an/an/a
Merck Sharp & Dohme Corp.
US Patent
Assay Description
Activated ERK2 activity was determined in an IMAP-FP assay (Molecular Devices). Using this assay format, the potency (IC50) of each compound was dete...
US Patent US9023865 (2015)
BindingDB Entry DOI: 10.7270/Q2PN94CC