null
SMILES: CCCN1CCC(CC1)NC(=O)c1cc2ccccc2n1Cc1cc(on1)-c1ccc(Cl)s1
InChI Key: InChIKey=WKYZTNUDHMDOAY-UHFFFAOYSA-N
Activity Spreadsheet -- Enzyme Inhibition Constant Data from BindingDB
Found 1 hit for monomerid = 15825
Trg + Lig
Ki
nM
ΔG°
kcal/mole
IC50
nM
Kd
nM
EC50/IC50
nM
koff
s-1
kon
M-1s-1
pHTemp
°C
Coagulation factor X
(Homo sapiens (Human))
BDBM15825
(1-{[5-(5-chlorothiophen-2-yl)-1,2-oxazol-3-yl]meth...)
Show SMILES CCCN1CCC(CC1)NC(=O)c1cc2ccccc2n1Cc1cc(on1)-c1ccc(Cl)s1
Show InChI InChI=1S/C25H27ClN4O2S/c1-2-11-29-12-9-18(10-13-29)27-25(31)21-14-17-5-3-4-6-20(17)30(21)16-19-15-22(32-28-19)23-7-8-24(26)33-23/h3-8,14-15,18H,2,9-13,16H2,1H3,(H,27,31)
Reactome pathway
64 -9.81n/an/an/an/an/a7.825
Aventis Pharma Deutschland GmbH
Assay Description
The inhibitory effect of test compound for human fXa was determined by using the chromogenic substrates S-2765. The hydrolysis rates of chromogenic s...
Bioorg Med Chem Lett 14: 4197-201 (2004)
Article DOI: 10.1016/j.bmcl.2004.06.019
BindingDB Entry DOI: 10.7270/Q2610XKM