null
SMILES: CC(C)NC1CCN(CC1)C(=O)c1cc2ccccc2n1Cc1cc(on1)-c1ccc(Cl)s1
InChI Key: InChIKey=HAHDTUXAQNSETN-UHFFFAOYSA-N
Activity Spreadsheet -- Enzyme Inhibition Constant Data from BindingDB
Found 1 hit for monomerid = 15831
Trg + Lig
Ki
nM
ΔG°
kcal/mole
IC50
nM
Kd
nM
EC50/IC50
nM
koff
s-1
kon
M-1s-1
pHTemp
°C
Coagulation factor X
(Homo sapiens (Human))
BDBM15831
(1-[(1-{[5-(5-chlorothiophen-2-yl)-1,2-oxazol-3-yl]...)
Show SMILES CC(C)NC1CCN(CC1)C(=O)c1cc2ccccc2n1Cc1cc(on1)-c1ccc(Cl)s1
Show InChI InChI=1S/C25H27ClN4O2S/c1-16(2)27-18-9-11-29(12-10-18)25(31)21-13-17-5-3-4-6-20(17)30(21)15-19-14-22(32-28-19)23-7-8-24(26)33-23/h3-8,13-14,16,18,27H,9-12,15H2,1-2H3
Reactome pathway
3.00E+3 -7.53n/an/an/an/an/a7.825
Aventis Pharma Deutschland GmbH
Assay Description
The inhibitory effect of test compound for human fXa was determined by using the chromogenic substrates S-2765. The hydrolysis rates of chromogenic s...
Bioorg Med Chem Lett 14: 4197-201 (2004)
Article DOI: 10.1016/j.bmcl.2004.06.019
BindingDB Entry DOI: 10.7270/Q2610XKM