BDBM158510 US9034574, XX
SMILES: OC1(CC(=NN1C(=S)c1ccccc1)c1ccccc1)C(F)(F)F
InChI Key: InChIKey=RIANETHNVIQQBE-UHFFFAOYSA-N
Data: 2 IC50
Activity Spreadsheet -- Enzyme Inhibition Constant Data from BindingDB
Found 2 hits for monomerid = 158510
Trg + Lig
Ki
nM
ΔG°
kcal/mole
IC50
nM
Kd
nM
EC50/IC50
nM
koff
s-1
kon
M-1s-1
pHTemp
°C
Methyl-CpG binding domain protein 2
(Homo sapiens (Human))
BDBM158510
(US9034574, XX)
Show SMILES OC1(CC(=NN1C(=S)c1ccccc1)c1ccccc1)C(F)(F)F |c:3|
Show InChI InChI=1S/C17H13F3N2OS/c18-17(19,20)16(23)11-14(12-7-3-1-4-8-12)21-22(16)15(24)13-9-5-2-6-10-13/h1-10,23H,11H2
Reactome pathway
US Patent
n/an/a 470n/an/an/an/an/an/a
The Johns Hopkins University
US Patent
Assay Description
DNA binding assays using recombinant MBDs. To produce recombinant His6-tagged MBD polypeptides from human MBD2 (MBD2-MBD), MBD2-MBD cDNA was amplifie...
US Patent US9034574 (2015)
BindingDB Entry DOI: 10.7270/Q2RF5SSN
Small conductance calcium-activated potassium channel protein 3
(Homo sapiens (Human))
BDBM158510
(US9034574, XX)
Show SMILES OC1(CC(=NN1C(=S)c1ccccc1)c1ccccc1)C(F)(F)F |c:3|
Show InChI InChI=1S/C17H13F3N2OS/c18-17(19,20)16(23)11-14(12-7-3-1-4-8-12)21-22(16)15(24)13-9-5-2-6-10-13/h1-10,23H,11H2
US Patent
n/an/a>2.00E+5n/an/an/an/an/an/a
The Johns Hopkins University
US Patent
Assay Description
DNA binding assays using recombinant MBDs. To produce recombinant His6-tagged MBD polypeptides from human MBD2 (MBD2-MBD), MBD2-MBD cDNA was amplifie...
US Patent US9034574 (2015)
BindingDB Entry DOI: 10.7270/Q2RF5SSN