null
SMILES: CC(C)N1CCC(CC1)NC(=O)c1cc2ccccc2n1Cc1cnc(s1)-c1ccc(Cl)cc1
InChI Key: InChIKey=FTRYLMSDUSKCSS-UHFFFAOYSA-N
Activity Spreadsheet -- Enzyme Inhibition Constant Data from BindingDB
Found 1 hit for monomerid = 15861
Trg + Lig
Ki
nM
ΔG°
kcal/mole
IC50
nM
Kd
nM
EC50/IC50
nM
koff
s-1
kon
M-1s-1
pHTemp
°C
Coagulation factor X
(Homo sapiens (Human))
BDBM15861
(1-{[2-(4-chlorophenyl)-1,3-thiazol-5-yl]methyl}-N-...)
Show SMILES CC(C)N1CCC(CC1)NC(=O)c1cc2ccccc2n1Cc1cnc(s1)-c1ccc(Cl)cc1
Show InChI InChI=1S/C27H29ClN4OS/c1-18(2)31-13-11-22(12-14-31)30-26(33)25-15-20-5-3-4-6-24(20)32(25)17-23-16-29-27(34-23)19-7-9-21(28)10-8-19/h3-10,15-16,18,22H,11-14,17H2,1-2H3,(H,30,33)
Reactome pathway
2.73E+3 -7.58n/an/an/an/an/a7.825
Aventis Pharma Deutschland GmbH
Assay Description
The inhibitory effect of test compound for human fXa was determined by using the chromogenic substrates S-2765. The hydrolysis rates of chromogenic s...
Bioorg Med Chem Lett 14: 4191-5 (2004)
Article DOI: 10.1016/j.bmcl.2004.06.020
BindingDB Entry DOI: 10.7270/Q22805WQ