BDBM159204 US9034866, 681
SMILES: CN1CC[C@](O)(C#Cc2ccc3OCC(F)(F)c4cc(nn4-c3c2)C(N)=O)C1=O
InChI Key: InChIKey=JBORNCQUAXUYNO-GOSISDBHSA-N
Data: 2 KI
Activity Spreadsheet -- Enzyme Inhibition Constant Data from BindingDB
Found 2 hits for monomerid = 159204
Trg + Lig
Ki
nM
ΔG°
kcal/mole
IC50
nM
Kd
nM
EC50/IC50
nM
koff
s-1
kon
M-1s-1
pHTemp
°C
Mitogen-activated protein kinase kinase kinase 14
(Homo sapiens (Human))
BDBM159204
(US9034866, 681)
Show SMILES CN1CC[C@](O)(C#Cc2ccc3OCC(F)(F)c4cc(nn4-c3c2)C(N)=O)C1=O |r|
Show InChI InChI=1S/C19H16F2N4O4/c1-24-7-6-18(28,17(24)27)5-4-11-2-3-14-13(8-11)25-15(19(20,21)10-29-14)9-12(23-25)16(22)26/h2-3,8-9,28H,6-7,10H2,1H3,(H2,22,26)/t18-/m1/s1
US Patent
0.330n/an/an/an/an/an/a7.2n/a
Genentech, Inc.
US Patent
Assay Description
The ability of the nuclear factor-kappa B (NF-kB)-inducing kinase (NIK) to catalyze the hydrolysis of adenosine-5'-triphosphate (ATP) was monitored u...
US Patent US9034866 (2015)
BindingDB Entry DOI: 10.7270/Q2GX49B0
Mitogen-activated protein kinase kinase kinase 14
(Homo sapiens (Human))
BDBM159204
(US9034866, 681)
Show SMILES CN1CC[C@](O)(C#Cc2ccc3OCC(F)(F)c4cc(nn4-c3c2)C(N)=O)C1=O |r|
Show InChI InChI=1S/C19H16F2N4O4/c1-24-7-6-18(28,17(24)27)5-4-11-2-3-14-13(8-11)25-15(19(20,21)10-29-14)9-12(23-25)16(22)26/h2-3,8-9,28H,6-7,10H2,1H3,(H2,22,26)/t18-/m1/s1
US Patent
>1.20E+3n/an/an/an/an/an/a7.2n/a
Genentech, Inc.
US Patent
Assay Description
The ability of the nuclear factor-kappa B (NF-kB)-inducing kinase (NIK) to catalyze the hydrolysis of adenosine-5'-triphosphate (ATP) was monitored u...
US Patent US9034866 (2015)
BindingDB Entry DOI: 10.7270/Q2GX49B0