BDBM159213 US10195186, Example 44::US9682967, 42
SMILES: CC(=C)c1ccc(C(=O)Nc2cccc(C)n2)c(c1)C(O)=O
InChI Key: InChIKey=AFAHRNMXIINIEN-UHFFFAOYSA-N
Data: 2 KI  2 IC50
Activity Spreadsheet -- Enzyme Inhibition Constant Data from BindingDB
Found 3 hits for monomerid = 159213
Trg + Lig
Ki
nM
ΔG°
kcal/mole
IC50
nM
Kd
nM
EC50/IC50
nM
koff
s-1
kon
M-1s-1
pHTemp
°C
Neurotensin receptor 3
(Homo sapiens (Human))
BDBM159213
(US10195186, Example 44 | US9682967, 42)
Show SMILES CC(=C)c1ccc(C(=O)Nc2cccc(C)n2)c(c1)C(O)=O
Show InChI InChI=1S/C17H16N2O3/c1-10(2)12-7-8-13(14(9-12)17(21)22)16(20)19-15-6-4-5-11(3)18-15/h4-9H,1H2,2-3H3,(H,21,22)(H,18,19,20)
NCI pathway
Reactome pathway
US Patent
286n/an/an/an/an/an/an/an/a
H. Lundbeck A/S
US Patent
Assay Description
The Sortilin assay was performed in total volume of 40 ul in 50 mM HEPES pH 7.4 assay buffer containing 100 mM NaCl, 2.0 mM CaCl2, 0.1% BSA and 0.1% ...
US Patent US10195186 (2019)
BindingDB Entry DOI: 10.7270/Q2474CZW
Neurotensin receptor 3
(Homo sapiens (Human))
BDBM159213
(US10195186, Example 44 | US9682967, 42)
Show SMILES CC(=C)c1ccc(C(=O)Nc2cccc(C)n2)c(c1)C(O)=O
Show InChI InChI=1S/C17H16N2O3/c1-10(2)12-7-8-13(14(9-12)17(21)22)16(20)19-15-6-4-5-11(3)18-15/h4-9H,1H2,2-3H3,(H,21,22)(H,18,19,20)
NCI pathway
Reactome pathway
US Patent
4.95E+3n/a 5.20E+3n/an/an/an/a7.4n/a
H. Lundbeck A/S
US Patent
Assay Description
The Sortilin assay was performed in total volume of 40 ul in 50 mM HEPES pH 7.4 assay buffer containing 100 mM NaCl, 2.0 mM CaCl2, 0.1% BSA and 0.1% ...
US Patent US9682967 (2017)
BindingDB Entry DOI: 10.7270/Q22805SC
Neurotensin receptor 3
(Homo sapiens (Human))
BDBM159213
(US10195186, Example 44 | US9682967, 42)
Show SMILES CC(=C)c1ccc(C(=O)Nc2cccc(C)n2)c(c1)C(O)=O
Show InChI InChI=1S/C17H16N2O3/c1-10(2)12-7-8-13(14(9-12)17(21)22)16(20)19-15-6-4-5-11(3)18-15/h4-9H,1H2,2-3H3,(H,21,22)(H,18,19,20)
NCI pathway
Reactome pathway
US Patent
n/an/a 300n/an/an/an/an/an/a
H. Lundbeck A/S
US Patent
Assay Description
The Sortilin assay was performed in total volume of 40 ul in 50 mM HEPES pH 7.4 assay buffer containing 100 mM NaCl, 2.0 mM CaCl2, 0.1% BSA and 0.1% ...
US Patent US10195186 (2019)
BindingDB Entry DOI: 10.7270/Q2474CZW