BDBM15923 Aminopyridine-Based Inhibitor 6b::N-(4-amino-5-cyano-6-ethoxypyridin-2-yl)pentanamide::Pentanoic Acid (4-Amino-5-cyano-6-ethoxypyridin-2-yl)amide
SMILES: CCCCC(=O)Nc1cc(N)c(C#N)c(OCC)n1
InChI Key: InChIKey=OHRMONDIKHEVCZ-UHFFFAOYSA-N
Data: 2 IC50
Activity Spreadsheet -- Enzyme Inhibition Constant Data from BindingDB
Found 2 hits for monomerid = 15923
Trg + Lig
Ki
nM
ΔG°
kcal/mole
IC50
nM
Kd
nM
EC50/IC50
nM
koff
s-1
kon
M-1s-1
pHTemp
°C
Mitogen-activated protein kinase 9
(Homo sapiens (Human))
BDBM15923
(Aminopyridine-Based Inhibitor 6b | N-(4-amino-5-cy...)
Show SMILES CCCCC(=O)Nc1cc(N)c(C#N)c(OCC)n1
Show InChI InChI=1S/C13H18N4O2/c1-3-5-6-12(18)16-11-7-10(15)9(8-14)13(17-11)19-4-2/h7H,3-6H2,1-2H3,(H3,15,16,17,18)
NCI pathway
Reactome pathway
n/an/a 690n/an/an/an/an/an/a
Abbott Laboratories
Assay Description
In vitro substrate phosphorylation using purified recombinant JNK, was incubated with substrate, and test compounds in the presence of 5uM ATP/ [gamm...
J Med Chem 49: 3563-80 (2006)
Article DOI: 10.1021/jm060199b
BindingDB Entry DOI: 10.7270/Q2P26WDX
Mitogen-activated protein kinase 8
(Homo sapiens (Human))
BDBM15923
(Aminopyridine-Based Inhibitor 6b | N-(4-amino-5-cy...)
Show SMILES CCCCC(=O)Nc1cc(N)c(C#N)c(OCC)n1
Show InChI InChI=1S/C13H18N4O2/c1-3-5-6-12(18)16-11-7-10(15)9(8-14)13(17-11)19-4-2/h7H,3-6H2,1-2H3,(H3,15,16,17,18)
NCI pathway
Reactome pathway
n/an/a 350n/an/an/an/a7.220
Abbott Laboratories
Assay Description
In vitro substrate phosphorylation using purified recombinant JNK, was incubated with substrate, and test compounds in the presence of 5uM ATP/ [gamm...
J Med Chem 49: 3563-80 (2006)
Article DOI: 10.1021/jm060199b
BindingDB Entry DOI: 10.7270/Q2P26WDX