BDBM159241 US9034866, 718
SMILES: CN1CC[C@@](O)(C#Cc2ccc3OCCc4c(C(F)F)c(nn4-c3c2)C(N)=O)C1=O
InChI Key: InChIKey=MIRBYHCQCSBBJZ-FQEVSTJZSA-N
Data: 1 KI
Activity Spreadsheet -- Enzyme Inhibition Constant Data from BindingDB
Found 1 hit for monomerid = 159241
Trg + Lig
Ki
nM
ΔG°
kcal/mole
IC50
nM
Kd
nM
EC50/IC50
nM
koff
s-1
kon
M-1s-1
pHTemp
°C
Mitogen-activated protein kinase kinase kinase 14
(Homo sapiens (Human))
BDBM159241
(US9034866, 718)
Show SMILES CN1CC[C@@](O)(C#Cc2ccc3OCCc4c(C(F)F)c(nn4-c3c2)C(N)=O)C1=O |r|
Show InChI InChI=1S/C20H18F2N4O4/c1-25-8-7-20(29,19(25)28)6-4-11-2-3-14-13(10-11)26-12(5-9-30-14)15(17(21)22)16(24-26)18(23)27/h2-3,10,17,29H,5,7-9H2,1H3,(H2,23,27)/t20-/m0/s1
US Patent
0.300n/an/an/an/an/an/a7.2n/a
Genentech, Inc.
US Patent
Assay Description
The ability of the nuclear factor-kappa B (NF-kB)-inducing kinase (NIK) to catalyze the hydrolysis of adenosine-5'-triphosphate (ATP) was monitored u...
US Patent US9034866 (2015)
BindingDB Entry DOI: 10.7270/Q2GX49B0