BDBM15927 Aminopyridine-Based Inhibitor 6f::N-(4-Amino-5-cyano-6-ethoxypyridin-2-yl)-2-(2-chlorophenyl)-acetamide::N-(4-amino-5-cyano-6-ethoxypyridin-2-yl)-2-(2-chlorophenyl)acetamide
SMILES: CCOc1nc(NC(=O)Cc2ccccc2Cl)cc(N)c1C#N
InChI Key: InChIKey=OOKAVNOVSANHGB-UHFFFAOYSA-N
Data: 2 IC50
Activity Spreadsheet -- Enzyme Inhibition Constant Data from BindingDB
Found 2 hits for monomerid = 15927
Trg + Lig
Ki
nM
ΔG°
kcal/mole
IC50
nM
Kd
nM
EC50/IC50
nM
koff
s-1
kon
M-1s-1
pHTemp
°C
Mitogen-activated protein kinase 9
(Homo sapiens (Human))
BDBM15927
(Aminopyridine-Based Inhibitor 6f | N-(4-Amino-5-cy...)
Show SMILES CCOc1nc(NC(=O)Cc2ccccc2Cl)cc(N)c1C#N
Show InChI InChI=1S/C16H15ClN4O2/c1-2-23-16-11(9-18)13(19)8-14(21-16)20-15(22)7-10-5-3-4-6-12(10)17/h3-6,8H,2,7H2,1H3,(H3,19,20,21,22)
NCI pathway
Reactome pathway
n/an/a 4.90E+3n/an/an/an/an/an/a
Abbott Laboratories
Assay Description
In vitro substrate phosphorylation using purified recombinant JNK, was incubated with substrate, and test compounds in the presence of 5uM ATP/ [gamm...
J Med Chem 49: 3563-80 (2006)
Article DOI: 10.1021/jm060199b
BindingDB Entry DOI: 10.7270/Q2P26WDX
Mitogen-activated protein kinase 8
(Homo sapiens (Human))
BDBM15927
(Aminopyridine-Based Inhibitor 6f | N-(4-Amino-5-cy...)
Show SMILES CCOc1nc(NC(=O)Cc2ccccc2Cl)cc(N)c1C#N
Show InChI InChI=1S/C16H15ClN4O2/c1-2-23-16-11(9-18)13(19)8-14(21-16)20-15(22)7-10-5-3-4-6-12(10)17/h3-6,8H,2,7H2,1H3,(H3,19,20,21,22)
NCI pathway
Reactome pathway
n/an/a 1.10E+3n/an/an/an/a7.220
Abbott Laboratories
Assay Description
In vitro substrate phosphorylation using purified recombinant JNK, was incubated with substrate, and test compounds in the presence of 5uM ATP/ [gamm...
J Med Chem 49: 3563-80 (2006)
Article DOI: 10.1021/jm060199b
BindingDB Entry DOI: 10.7270/Q2P26WDX