BDBM15929 Aminopyridine-Based Inhibitor 6h::N-(4-Amino-5-cyano-6-ethoxypyridin-2-yl)-2-(4-chlorophenyl)acetamide
SMILES: CCOc1nc(NC(=O)Cc2ccc(Cl)cc2)cc(N)c1C#N
InChI Key: InChIKey=CLCSSDBGIADDIH-UHFFFAOYSA-N
Data: 2 IC50
Activity Spreadsheet -- Enzyme Inhibition Constant Data from BindingDB
Found 2 hits for monomerid = 15929
Trg + Lig
Ki
nM
ΔG°
kcal/mole
IC50
nM
Kd
nM
EC50/IC50
nM
koff
s-1
kon
M-1s-1
pHTemp
°C
Mitogen-activated protein kinase 9
(Homo sapiens (Human))
BDBM15929
(Aminopyridine-Based Inhibitor 6h | N-(4-Amino-5-cy...)
Show SMILES CCOc1nc(NC(=O)Cc2ccc(Cl)cc2)cc(N)c1C#N
Show InChI InChI=1S/C16H15ClN4O2/c1-2-23-16-12(9-18)13(19)8-14(21-16)20-15(22)7-10-3-5-11(17)6-4-10/h3-6,8H,2,7H2,1H3,(H3,19,20,21,22)
NCI pathway
Reactome pathway
n/an/a 610n/an/an/an/an/an/a
Abbott Laboratories
Assay Description
In vitro substrate phosphorylation using purified recombinant JNK, was incubated with substrate, and test compounds in the presence of 5uM ATP/ [gamm...
J Med Chem 49: 3563-80 (2006)
Article DOI: 10.1021/jm060199b
BindingDB Entry DOI: 10.7270/Q2P26WDX
Mitogen-activated protein kinase 8
(Homo sapiens (Human))
BDBM15929
(Aminopyridine-Based Inhibitor 6h | N-(4-Amino-5-cy...)
Show SMILES CCOc1nc(NC(=O)Cc2ccc(Cl)cc2)cc(N)c1C#N
Show InChI InChI=1S/C16H15ClN4O2/c1-2-23-16-12(9-18)13(19)8-14(21-16)20-15(22)7-10-3-5-11(17)6-4-10/h3-6,8H,2,7H2,1H3,(H3,19,20,21,22)
NCI pathway
Reactome pathway
n/an/a 580n/an/an/an/a7.220
Abbott Laboratories
Assay Description
In vitro substrate phosphorylation using purified recombinant JNK, was incubated with substrate, and test compounds in the presence of 5uM ATP/ [gamm...
J Med Chem 49: 3563-80 (2006)
Article DOI: 10.1021/jm060199b
BindingDB Entry DOI: 10.7270/Q2P26WDX