BDBM15930 Aminopyridine-Based Inhibitor 6i::N-(4-Amino-5-cyano-6-ethoxypyridin-2-yl)-2-o-tolylacetamide::N-(4-amino-5-cyano-6-ethoxypyridin-2-yl)-2-(2-methylphenyl)acetamide
SMILES: CCOc1nc(NC(=O)Cc2ccccc2C)cc(N)c1C#N
InChI Key: InChIKey=KEISYNODBQSSPV-UHFFFAOYSA-N
Data: 2 IC50
Activity Spreadsheet -- Enzyme Inhibition Constant Data from BindingDB
Found 2 hits for monomerid = 15930
Trg + Lig
Ki
nM
ΔG°
kcal/mole
IC50
nM
Kd
nM
EC50/IC50
nM
koff
s-1
kon
M-1s-1
pHTemp
°C
Mitogen-activated protein kinase 9
(Homo sapiens (Human))
BDBM15930
(Aminopyridine-Based Inhibitor 6i | N-(4-Amino-5-cy...)
Show SMILES CCOc1nc(NC(=O)Cc2ccccc2C)cc(N)c1C#N
Show InChI InChI=1S/C17H18N4O2/c1-3-23-17-13(10-18)14(19)9-15(21-17)20-16(22)8-12-7-5-4-6-11(12)2/h4-7,9H,3,8H2,1-2H3,(H3,19,20,21,22)
NCI pathway
Reactome pathway
n/an/a 740n/an/an/an/an/an/a
Abbott Laboratories
Assay Description
In vitro substrate phosphorylation using purified recombinant JNK, was incubated with substrate, and test compounds in the presence of 5uM ATP/ [gamm...
J Med Chem 49: 3563-80 (2006)
Article DOI: 10.1021/jm060199b
BindingDB Entry DOI: 10.7270/Q2P26WDX
Mitogen-activated protein kinase 8
(Homo sapiens (Human))
BDBM15930
(Aminopyridine-Based Inhibitor 6i | N-(4-Amino-5-cy...)
Show SMILES CCOc1nc(NC(=O)Cc2ccccc2C)cc(N)c1C#N
Show InChI InChI=1S/C17H18N4O2/c1-3-23-17-13(10-18)14(19)9-15(21-17)20-16(22)8-12-7-5-4-6-11(12)2/h4-7,9H,3,8H2,1-2H3,(H3,19,20,21,22)
NCI pathway
Reactome pathway
n/an/a 400n/an/an/an/a7.220
Abbott Laboratories
Assay Description
In vitro substrate phosphorylation using purified recombinant JNK, was incubated with substrate, and test compounds in the presence of 5uM ATP/ [gamm...
J Med Chem 49: 3563-80 (2006)
Article DOI: 10.1021/jm060199b
BindingDB Entry DOI: 10.7270/Q2P26WDX