BDBM159303 US10093663, Example 13::US9682968, Example-13
SMILES: Cc1cc(Cl)c(CN2CCCCC2c2ccc(cc2)C(O)=O)c2cc[nH]c12
InChI Key:
Data: 2 IC50
Activity Spreadsheet -- Enzyme Inhibition Constant Data from BindingDB
Found 2 hits for monomerid = 159303
Trg + Lig
Ki
nM
ΔG°
kcal/mole
IC50
nM
Kd
nM
EC50/IC50
nM
koff
s-1
kon
M-1s-1
pHTemp
°C
Complement factor B
(Homo sapiens (Human))
BDBM159303
(US10093663, Example 13 | US9682968, Example-13)
Show SMILES Cc1cc(Cl)c(CN2CCCCC2c2ccc(cc2)C(O)=O)c2cc[nH]c12
US Patent
n/an/a 140n/an/an/an/a7.425
Novartis AG
US Patent
Assay Description
CVF-Bb complex prepared from purified cobra venom factor (1 μM), recombinant human complement factor B (expressed in drosophila cells and purifi...
US Patent US10093663 (2018)
BindingDB Entry DOI: 10.7270/Q2DF6T75
Complement factor B
(Homo sapiens (Human))
BDBM159303
(US10093663, Example 13 | US9682968, Example-13)
Show SMILES Cc1cc(Cl)c(CN2CCCCC2c2ccc(cc2)C(O)=O)c2cc[nH]c12
US Patent
n/an/a 0.140n/an/an/an/an/an/a
Novartis AG
US Patent
Assay Description
CVF-Bb complex prepared from purified cobra venom factor (1 μM), recombinant human complement factor B (expressed in drosophila cells and purifi...
US Patent US9682968 (2017)
BindingDB Entry DOI: 10.7270/Q2XG9P9J