BDBM15934 Aminopyridine-Based Inhibitor 6m::N-(4-Amino-5-cyano-6-ethoxypyridin-2-yl)-2-(3-methoxyphenyl)acetamide
SMILES: CCOc1nc(NC(=O)Cc2cccc(OC)c2)cc(N)c1C#N
InChI Key: InChIKey=JIVYDIADMNEKCM-UHFFFAOYSA-N
Data: 2 IC50
PDB links: 1 PDB ID contains this monomer as substructures. 1 PDB ID contains inhibitors having a similarity of 90% to this monomer.
Activity Spreadsheet -- Enzyme Inhibition Constant Data from BindingDB
Found 2 hits for monomerid = 15934
Trg + Lig
Ki
nM
ΔG°
kcal/mole
IC50
nM
Kd
nM
EC50/IC50
nM
koff
s-1
kon
M-1s-1
pHTemp
°C
Mitogen-activated protein kinase 9
(Homo sapiens (Human))
BDBM15934
(Aminopyridine-Based Inhibitor 6m | N-(4-Amino-5-cy...)
Show SMILES CCOc1nc(NC(=O)Cc2cccc(OC)c2)cc(N)c1C#N
Show InChI InChI=1S/C17H18N4O3/c1-3-24-17-13(10-18)14(19)9-15(21-17)20-16(22)8-11-5-4-6-12(7-11)23-2/h4-7,9H,3,8H2,1-2H3,(H3,19,20,21,22)
NCI pathway
Reactome pathway
n/an/a 310n/an/an/an/an/an/a
Abbott Laboratories
Assay Description
In vitro substrate phosphorylation using purified recombinant JNK, was incubated with substrate, and test compounds in the presence of 5uM ATP/ [gamm...
J Med Chem 49: 3563-80 (2006)
Article DOI: 10.1021/jm060199b
BindingDB Entry DOI: 10.7270/Q2P26WDX
Mitogen-activated protein kinase 8
(Homo sapiens (Human))
BDBM15934
(Aminopyridine-Based Inhibitor 6m | N-(4-Amino-5-cy...)
Show SMILES CCOc1nc(NC(=O)Cc2cccc(OC)c2)cc(N)c1C#N
Show InChI InChI=1S/C17H18N4O3/c1-3-24-17-13(10-18)14(19)9-15(21-17)20-16(22)8-11-5-4-6-12(7-11)23-2/h4-7,9H,3,8H2,1-2H3,(H3,19,20,21,22)
NCI pathway
Reactome pathway
n/an/a 210n/an/an/an/a7.220
Abbott Laboratories
Assay Description
In vitro substrate phosphorylation using purified recombinant JNK, was incubated with substrate, and test compounds in the presence of 5uM ATP/ [gamm...
J Med Chem 49: 3563-80 (2006)
Article DOI: 10.1021/jm060199b
BindingDB Entry DOI: 10.7270/Q2P26WDX