BDBM15936 Aminopyridine-Based Inhibitor 6p::N-(4-Amino-5-cyano-6-ethoxypyridin-2-yl)-2-(2,5-dimethylphenyl)acetamide
SMILES: CCOc1nc(NC(=O)Cc2cc(C)ccc2C)cc(N)c1C#N
InChI Key: InChIKey=KVRDVBWKZWPKFE-UHFFFAOYSA-N
Data: 2 IC50
Activity Spreadsheet -- Enzyme Inhibition Constant Data from BindingDB
Found 2 hits for monomerid = 15936
Trg + Lig
Ki
nM
ΔG°
kcal/mole
IC50
nM
Kd
nM
EC50/IC50
nM
koff
s-1
kon
M-1s-1
pHTemp
°C
Mitogen-activated protein kinase 9
(Homo sapiens (Human))
BDBM15936
(Aminopyridine-Based Inhibitor 6p | N-(4-Amino-5-cy...)
Show SMILES CCOc1nc(NC(=O)Cc2cc(C)ccc2C)cc(N)c1C#N
Show InChI InChI=1S/C18H20N4O2/c1-4-24-18-14(10-19)15(20)9-16(22-18)21-17(23)8-13-7-11(2)5-6-12(13)3/h5-7,9H,4,8H2,1-3H3,(H3,20,21,22,23)
NCI pathway
Reactome pathway
n/an/a>1.00E+4n/an/an/an/an/an/a
Abbott Laboratories
Assay Description
In vitro substrate phosphorylation using purified recombinant JNK, was incubated with substrate, and test compounds in the presence of 5uM ATP/ [gamm...
J Med Chem 49: 3563-80 (2006)
Article DOI: 10.1021/jm060199b
BindingDB Entry DOI: 10.7270/Q2P26WDX
Mitogen-activated protein kinase 8
(Homo sapiens (Human))
BDBM15936
(Aminopyridine-Based Inhibitor 6p | N-(4-Amino-5-cy...)
Show SMILES CCOc1nc(NC(=O)Cc2cc(C)ccc2C)cc(N)c1C#N
Show InChI InChI=1S/C18H20N4O2/c1-4-24-18-14(10-19)15(20)9-16(22-18)21-17(23)8-13-7-11(2)5-6-12(13)3/h5-7,9H,4,8H2,1-3H3,(H3,20,21,22,23)
NCI pathway
Reactome pathway
n/an/a 4.40E+3n/an/an/an/an/an/a
Abbott Laboratories
Assay Description
In vitro substrate phosphorylation using purified recombinant JNK, was incubated with substrate, and test compounds in the presence of 5uM ATP/ [gamm...
J Med Chem 49: 3563-80 (2006)
Article DOI: 10.1021/jm060199b
BindingDB Entry DOI: 10.7270/Q2P26WDX