BDBM15937 Aminopyridine-Based Inhibitor 6q::N-(4-Amino-5-cyano-6-ethoxypyridin-2-yl)-2-(2,5-dibromophenyl)acetamide
SMILES: CCOc1nc(NC(=O)Cc2cc(Br)ccc2Br)cc(N)c1C#N
InChI Key: InChIKey=JNCRDJFWGNSROM-UHFFFAOYSA-N
Data: 2 IC50
Activity Spreadsheet -- Enzyme Inhibition Constant Data from BindingDB
Found 2 hits for monomerid = 15937
Trg + Lig
Ki
nM
ΔG°
kcal/mole
IC50
nM
Kd
nM
EC50/IC50
nM
koff
s-1
kon
M-1s-1
pHTemp
°C
Mitogen-activated protein kinase 9
(Homo sapiens (Human))
BDBM15937
(Aminopyridine-Based Inhibitor 6q | N-(4-Amino-5-cy...)
Show SMILES CCOc1nc(NC(=O)Cc2cc(Br)ccc2Br)cc(N)c1C#N
Show InChI InChI=1S/C16H14Br2N4O2/c1-2-24-16-11(8-19)13(20)7-14(22-16)21-15(23)6-9-5-10(17)3-4-12(9)18/h3-5,7H,2,6H2,1H3,(H3,20,21,22,23)
NCI pathway
Reactome pathway
n/an/a>1.00E+4n/an/an/an/an/an/a
Abbott Laboratories
Assay Description
In vitro substrate phosphorylation using purified recombinant JNK, was incubated with substrate, and test compounds in the presence of 5uM ATP/ [gamm...
J Med Chem 49: 3563-80 (2006)
Article DOI: 10.1021/jm060199b
BindingDB Entry DOI: 10.7270/Q2P26WDX
Mitogen-activated protein kinase 8
(Homo sapiens (Human))
BDBM15937
(Aminopyridine-Based Inhibitor 6q | N-(4-Amino-5-cy...)
Show SMILES CCOc1nc(NC(=O)Cc2cc(Br)ccc2Br)cc(N)c1C#N
Show InChI InChI=1S/C16H14Br2N4O2/c1-2-24-16-11(8-19)13(20)7-14(22-16)21-15(23)6-9-5-10(17)3-4-12(9)18/h3-5,7H,2,6H2,1H3,(H3,20,21,22,23)
NCI pathway
Reactome pathway
n/an/a 3.00E+3n/an/an/an/an/an/a
Abbott Laboratories
Assay Description
In vitro substrate phosphorylation using purified recombinant JNK, was incubated with substrate, and test compounds in the presence of 5uM ATP/ [gamm...
J Med Chem 49: 3563-80 (2006)
Article DOI: 10.1021/jm060199b
BindingDB Entry DOI: 10.7270/Q2P26WDX