BDBM15940 Aminopyridine-Based Inhibitor 6t::N-(4-Amino-5-cyano-6-ethoxypyridin-2-yl)-2-(4-bromo-2,5-dimethoxyphenyl)acetamide
SMILES: CCOc1nc(NC(=O)Cc2cc(OC)c(Br)cc2OC)cc(N)c1C#N
InChI Key: InChIKey=GKODDLYLEKSDJL-UHFFFAOYSA-N
Data: 2 IC50
PDB links: 1 PDB ID matches this monomer.
Activity Spreadsheet -- Enzyme Inhibition Constant Data from BindingDB
Found 2 hits for monomerid = 15940
Trg + Lig
Ki
nM
ΔG°
kcal/mole
IC50
nM
Kd
nM
EC50/IC50
nM
koff
s-1
kon
M-1s-1
pHTemp
°C
Mitogen-activated protein kinase 9
(Homo sapiens (Human))
BDBM15940
(Aminopyridine-Based Inhibitor 6t | N-(4-Amino-5-cy...)
Show SMILES CCOc1nc(NC(=O)Cc2cc(OC)c(Br)cc2OC)cc(N)c1C#N
Show InChI InChI=1S/C18H19BrN4O4/c1-4-27-18-11(9-20)13(21)8-16(23-18)22-17(24)6-10-5-15(26-3)12(19)7-14(10)25-2/h5,7-8H,4,6H2,1-3H3,(H3,21,22,23,24)
NCI pathway
Reactome pathway
n/an/a 160n/an/an/an/an/an/a
Abbott Laboratories
Assay Description
In vitro substrate phosphorylation using purified recombinant JNK, was incubated with substrate, and test compounds in the presence of 5uM ATP/ [gamm...
J Med Chem 49: 3563-80 (2006)
Article DOI: 10.1021/jm060199b
BindingDB Entry DOI: 10.7270/Q2P26WDX
Mitogen-activated protein kinase 8
(Homo sapiens (Human))
BDBM15940
(Aminopyridine-Based Inhibitor 6t | N-(4-Amino-5-cy...)
Show SMILES CCOc1nc(NC(=O)Cc2cc(OC)c(Br)cc2OC)cc(N)c1C#N
Show InChI InChI=1S/C18H19BrN4O4/c1-4-27-18-11(9-20)13(21)8-16(23-18)22-17(24)6-10-5-15(26-3)12(19)7-14(10)25-2/h5,7-8H,4,6H2,1-3H3,(H3,21,22,23,24)
NCI pathway
Reactome pathway
n/an/a 77n/an/an/an/an/an/a
Abbott Laboratories
Assay Description
In vitro substrate phosphorylation using purified recombinant JNK, was incubated with substrate, and test compounds in the presence of 5uM ATP/ [gamm...
J Med Chem 49: 3563-80 (2006)
Article DOI: 10.1021/jm060199b
BindingDB Entry DOI: 10.7270/Q2P26WDX
3D
3D Structure (crystal)