BDBM15942 (4-Amino-5-cyano-6-ethoxypyridin-2-yl)carbamic Acid Methyl Ester::Aminopyridine-Based Inhibitor 7::methyl N-(4-amino-5-cyano-6-ethoxypyridin-2-yl)carbamate
SMILES: CCOc1nc(NC(=O)OC)cc(N)c1C#N
InChI Key: InChIKey=YXSAXIXYUBQUIW-UHFFFAOYSA-N
Data: 2 IC50
Activity Spreadsheet -- Enzyme Inhibition Constant Data from BindingDB
Found 2 hits for monomerid = 15942
Trg + Lig
Ki
nM
ΔG°
kcal/mole
IC50
nM
Kd
nM
EC50/IC50
nM
koff
s-1
kon
M-1s-1
pHTemp
°C
Mitogen-activated protein kinase 9
(Homo sapiens (Human))
BDBM15942
((4-Amino-5-cyano-6-ethoxypyridin-2-yl)carbamic Aci...)
Show SMILES CCOc1nc(NC(=O)OC)cc(N)c1C#N
Show InChI InChI=1S/C10H12N4O3/c1-3-17-9-6(5-11)7(12)4-8(13-9)14-10(15)16-2/h4H,3H2,1-2H3,(H3,12,13,14,15)
NCI pathway
Reactome pathway
n/an/a>1.00E+4n/an/an/an/an/an/a
Abbott Laboratories
Assay Description
In vitro substrate phosphorylation using purified recombinant JNK, was incubated with substrate, and test compounds in the presence of 5uM ATP/ [gamm...
J Med Chem 49: 3563-80 (2006)
Article DOI: 10.1021/jm060199b
BindingDB Entry DOI: 10.7270/Q2P26WDX
Mitogen-activated protein kinase 8
(Homo sapiens (Human))
BDBM15942
((4-Amino-5-cyano-6-ethoxypyridin-2-yl)carbamic Aci...)
Show SMILES CCOc1nc(NC(=O)OC)cc(N)c1C#N
Show InChI InChI=1S/C10H12N4O3/c1-3-17-9-6(5-11)7(12)4-8(13-9)14-10(15)16-2/h4H,3H2,1-2H3,(H3,12,13,14,15)
NCI pathway
Reactome pathway
n/an/a>1.00E+4n/an/an/an/an/an/a
Abbott Laboratories
Assay Description
In vitro substrate phosphorylation using purified recombinant JNK, was incubated with substrate, and test compounds in the presence of 5uM ATP/ [gamm...
J Med Chem 49: 3563-80 (2006)
Article DOI: 10.1021/jm060199b
BindingDB Entry DOI: 10.7270/Q2P26WDX