BDBM159458 US9034921, E098
SMILES: CS[C@H]1O[C@H]([C@H](O)[C@@H](O)[C@@H]1O)c1cc(Cc2ccc3OCCOc3c2)c(Cl)cc1O
InChI Key: InChIKey=GSFKYLKIWBEFHC-CRSSMBPESA-N
Data: 1 IC50
Activity Spreadsheet -- Enzyme Inhibition Constant Data from BindingDB
Found 1 hit for monomerid = 159458
Trg + Lig
Ki
nM
ΔG°
kcal/mole
IC50
nM
Kd
nM
EC50/IC50
nM
koff
s-1
kon
M-1s-1
pHTemp
°C
Sodium/glucose cotransporter 2
(Homo sapiens (Human))
BDBM159458
(US9034921, E098)
Show SMILES CS[C@H]1O[C@H]([C@H](O)[C@@H](O)[C@@H]1O)c1cc(Cc2ccc3OCCOc3c2)c(Cl)cc1O |r|
Show InChI InChI=1S/C21H23ClO7S/c1-30-21-19(26)17(24)18(25)20(29-21)12-8-11(13(22)9-14(12)23)6-10-2-3-15-16(7-10)28-5-4-27-15/h2-3,7-9,17-21,23-26H,4-6H2,1H3/t17-,18-,19+,20+,21-/m1/s1
US Patent
n/an/a 0.454n/an/an/an/a7.437
GREEN CROSS CORPORATION
US Patent
Assay Description
For sodium-dependent glucose transport assay, cells expressing hSGLT2 were seeded into a 96-well culture plate at a density of 5x104 cells/well in RP...
US Patent US9034921 (2015)
BindingDB Entry DOI: 10.7270/Q2QF8RMT