BDBM159511 US9034921, E153
SMILES: CCc1ccc(Cc2cc([C@@H]3O[C@H](CO)[C@@H](O)[C@H](O)[C@H]3O)c3C(C)COc3c2Cl)cc1
InChI Key: InChIKey=GQUDFHOMTWNRFA-DUAOFFNGSA-N
Data: 1 IC50
Activity Spreadsheet -- Enzyme Inhibition Constant Data from BindingDB
Found 1 hit for monomerid = 159511
Trg + Lig
Ki
nM
ΔG°
kcal/mole
IC50
nM
Kd
nM
EC50/IC50
nM
koff
s-1
kon
M-1s-1
pHTemp
°C
Sodium/glucose cotransporter 2
(Homo sapiens (Human))
BDBM159511
(US9034921, E153)
Show SMILES CCc1ccc(Cc2cc([C@@H]3O[C@H](CO)[C@@H](O)[C@H](O)[C@H]3O)c3C(C)COc3c2Cl)cc1 |r,w:22.23|
Show InChI InChI=1S/C24H29ClO6/c1-3-13-4-6-14(7-5-13)8-15-9-16(18-12(2)11-30-24(18)19(15)25)23-22(29)21(28)20(27)17(10-26)31-23/h4-7,9,12,17,20-23,26-29H,3,8,10-11H2,1-2H3/t12?,17-,20-,21+,22-,23+/m1/s1
US Patent
n/an/a 0.721n/an/an/an/a7.437
GREEN CROSS CORPORATION
US Patent
Assay Description
For sodium-dependent glucose transport assay, cells expressing hSGLT2 were seeded into a 96-well culture plate at a density of 5x104 cells/well in RP...
US Patent US9034921 (2015)
BindingDB Entry DOI: 10.7270/Q2QF8RMT