BDBM159615 US9035059, 6-17
SMILES: CC(C)(C)c1ccc(CCN2CCc3cc(ccc3C2)S(=O)(=O)Nc2ccc(CCCC3CCCC3)cc2F)cc1
InChI Key: InChIKey=ICLDKNZXNSRJSI-UHFFFAOYSA-N
Data: 1 IC50
Activity Spreadsheet -- Enzyme Inhibition Constant Data from BindingDB
Found 1 hit for monomerid = 159615
Trg + Lig
Ki
nM
ΔG°
kcal/mole
IC50
nM
Kd
nM
EC50/IC50
nM
koff
s-1
kon
M-1s-1
pHTemp
°C
2-acylglycerol O-acyltransferase 2
(Homo sapiens (Human))
BDBM159615
(US9035059, 6-17)
Show SMILES CC(C)(C)c1ccc(CCN2CCc3cc(ccc3C2)S(=O)(=O)Nc2ccc(CCCC3CCCC3)cc2F)cc1
Show InChI InChI=1S/C35H45FN2O2S/c1-35(2,3)31-15-11-27(12-16-31)19-21-38-22-20-29-24-32(17-14-30(29)25-38)41(39,40)37-34-18-13-28(23-33(34)36)10-6-9-26-7-4-5-8-26/h11-18,23-24,26,37H,4-10,19-22,25H2,1-3H3
US Patent
n/an/a 28n/an/an/an/an/an/a
TAISHO PHARMACEUTICAL CO., LTD.
US Patent
Assay Description
A test for MGAT2 inhibitory action of test compounds was conducted in accordance with a partially modified version of the method described in John F....
US Patent US9035059 (2015)
BindingDB Entry DOI: 10.7270/Q2B856WH