BDBM159622 US9035059, 6-31
SMILES: CC(C)(C)c1ccc(CN2CCc3cc(ccc3C2)S(=O)(=O)Nc2ccc(CCCC3CCCC3)cc2F)cn1
InChI Key: InChIKey=FTSXEQUIWCOSHV-UHFFFAOYSA-N
Data: 1 IC50
Activity Spreadsheet -- Enzyme Inhibition Constant Data from BindingDB
Found 1 hit for monomerid = 159622
Trg + Lig
Ki
nM
ΔG°
kcal/mole
IC50
nM
Kd
nM
EC50/IC50
nM
koff
s-1
kon
M-1s-1
pHTemp
°C
Acyl-CoA:monoacylglycerol acyltransferase 2 (MOGAT2)
(Homo sapiens (Human))
BDBM159622
(US9035059, 6-31)
Show SMILES CC(C)(C)c1ccc(CN2CCc3cc(ccc3C2)S(=O)(=O)Nc2ccc(CCCC3CCCC3)cc2F)cn1
Show InChI InChI=1S/C33H42FN3O2S/c1-33(2,3)32-16-12-26(21-35-32)22-37-18-17-27-20-29(14-13-28(27)23-37)40(38,39)36-31-15-11-25(19-30(31)34)10-6-9-24-7-4-5-8-24/h11-16,19-21,24,36H,4-10,17-18,22-23H2,1-3H3
US Patent
n/an/a 31n/an/an/an/an/an/a
TAISHO PHARMACEUTICAL CO., LTD.
US Patent
Assay Description
A test for MGAT2 inhibitory action of test compounds was conducted in accordance with a partially modified version of the method described in John F....
US Patent US9035059 (2015)
BindingDB Entry DOI: 10.7270/Q2B856WH