BDBM159651 US9035059, 7-56
SMILES: CC(C)(C)c1ncc(CN2CCc3cc(ccc3C2)S(=O)(=O)Nc2ccc(CCCC3CCCC3)cc2F)cn1
InChI Key: InChIKey=GKNLZBGIGHIVOO-UHFFFAOYSA-N
Data: 1 IC50
Activity Spreadsheet -- Enzyme Inhibition Constant Data from BindingDB
Found 1 hit for monomerid = 159651
Trg + Lig
Ki
nM
ΔG°
kcal/mole
IC50
nM
Kd
nM
EC50/IC50
nM
koff
s-1
kon
M-1s-1
pHTemp
°C
Acyl-CoA:monoacylglycerol acyltransferase 2 (MOGAT2)
(Homo sapiens (Human))
BDBM159651
(US9035059, 7-56)
Show SMILES CC(C)(C)c1ncc(CN2CCc3cc(ccc3C2)S(=O)(=O)Nc2ccc(CCCC3CCCC3)cc2F)cn1
Show InChI InChI=1S/C32H41FN4O2S/c1-32(2,3)31-34-19-25(20-35-31)21-37-16-15-26-18-28(13-12-27(26)22-37)40(38,39)36-30-14-11-24(17-29(30)33)10-6-9-23-7-4-5-8-23/h11-14,17-20,23,36H,4-10,15-16,21-22H2,1-3H3
US Patent
n/an/a 52n/an/an/an/an/an/a
TAISHO PHARMACEUTICAL CO., LTD.
US Patent
Assay Description
A test for MGAT2 inhibitory action of test compounds was conducted in accordance with a partially modified version of the method described in John F....
US Patent US9035059 (2015)
BindingDB Entry DOI: 10.7270/Q2B856WH