BDBM159729 US9035059, 19-12
SMILES: CC(C)(C)c1ccc(NC(=O)N2Cc3ccc(cc3C2)S(=O)(=O)Nc2ccc(OCCc3ccccn3)cc2F)cc1
InChI Key: InChIKey=GRLIDZYVWLKOAD-UHFFFAOYSA-N
Data: 1 IC50
Activity Spreadsheet -- Enzyme Inhibition Constant Data from BindingDB
Found 1 hit for monomerid = 159729
Trg + Lig
Ki
nM
ΔG°
kcal/mole
IC50
nM
Kd
nM
EC50/IC50
nM
koff
s-1
kon
M-1s-1
pHTemp
°C
Acyl-CoA:monoacylglycerol acyltransferase 2 (MOGAT2)
(Homo sapiens (Human))
BDBM159729
(US9035059, 19-12)
Show SMILES CC(C)(C)c1ccc(NC(=O)N2Cc3ccc(cc3C2)S(=O)(=O)Nc2ccc(OCCc3ccccn3)cc2F)cc1
Show InChI InChI=1S/C32H33FN4O4S/c1-32(2,3)24-8-10-26(11-9-24)35-31(38)37-20-22-7-13-28(18-23(22)21-37)42(39,40)36-30-14-12-27(19-29(30)33)41-17-15-25-6-4-5-16-34-25/h4-14,16,18-19,36H,15,17,20-21H2,1-3H3,(H,35,38)
US Patent
n/an/a 23n/an/an/an/an/an/a
TAISHO PHARMACEUTICAL CO., LTD.
US Patent
Assay Description
A test for MGAT2 inhibitory action of test compounds was conducted in accordance with a partially modified version of the method described in John F....
US Patent US9035059 (2015)
BindingDB Entry DOI: 10.7270/Q2B856WH