BDBM159781 US10966980, Example 32::US9035074, 32
SMILES: CN([C@@H]1C[C@H](CS(=O)(=O)CCC2CC2)C1)c1ncnc2[nH]ccc12
InChI Key:
Data: 8 IC50
Activity Spreadsheet -- Enzyme Inhibition Constant Data from BindingDB
Found 8 hits for monomerid = 159781
Trg + Lig
Ki
nM
ΔG°
kcal/mole
IC50
nM
Kd
nM
EC50/IC50
nM
koff
s-1
kon
M-1s-1
pHTemp
°C
Tyrosine-protein kinase JAK1
(Homo sapiens (Human))
BDBM159781
(US10966980, Example 32 | US9035074, 32)
Show SMILES CN([C@@H]1C[C@H](CS(=O)(=O)CCC2CC2)C1)c1ncnc2[nH]ccc12 |r,wD:2.1,4.4,(-5.82,.84,;-4.49,.07,;-3.16,.84,;-3.16,2.38,;-1.62,2.38,;-.53,3.47,;.96,3.07,;1.36,4.55,;.56,1.58,;2.45,2.67,;2.85,1.18,;4.33,.78,;5.42,-.31,;5.82,1.18,;-1.62,.84,;-4.49,-1.47,;-5.82,-2.24,;-5.82,-3.78,;-4.49,-4.55,;-3.16,-3.78,;-1.69,-4.26,;-.79,-3.01,;-1.69,-1.77,;-3.16,-2.24,)|
Reactome pathway
US Patent
n/an/a 14n/an/an/an/a7.425
Pfizer Inc.
US Patent
Assay Description
Test article and assay controls were added to a 384-well plate. Reaction mixtures contained 20 mM HEPES, pH 7.4, 10 mM magnesium chloride, 0.01% bovi...
US Patent US9035074 (2015)
BindingDB Entry DOI: 10.7270/Q26H4G56
Tyrosine-protein kinase JAK2
(Homo sapiens (Human))
BDBM159781
(US10966980, Example 32 | US9035074, 32)
Show SMILES CN([C@@H]1C[C@H](CS(=O)(=O)CCC2CC2)C1)c1ncnc2[nH]ccc12 |r,wD:2.1,4.4,(-5.82,.84,;-4.49,.07,;-3.16,.84,;-3.16,2.38,;-1.62,2.38,;-.53,3.47,;.96,3.07,;1.36,4.55,;.56,1.58,;2.45,2.67,;2.85,1.18,;4.33,.78,;5.42,-.31,;5.82,1.18,;-1.62,.84,;-4.49,-1.47,;-5.82,-2.24,;-5.82,-3.78,;-4.49,-4.55,;-3.16,-3.78,;-1.69,-4.26,;-.79,-3.01,;-1.69,-1.77,;-3.16,-2.24,)|
Reactome pathway
US Patent
n/an/a 426n/an/an/an/a7.425
Pfizer Inc.
US Patent
Assay Description
Test article and assay controls were added to a 384-well plate. Reaction mixtures contained 20 mM HEPES, pH 7.4, 10 mM magnesium chloride, 0.01% bovi...
US Patent US9035074 (2015)
BindingDB Entry DOI: 10.7270/Q26H4G56
Tyrosine-protein kinase JAK3
(Homo sapiens (Human))
BDBM159781
(US10966980, Example 32 | US9035074, 32)
Show SMILES CN([C@@H]1C[C@H](CS(=O)(=O)CCC2CC2)C1)c1ncnc2[nH]ccc12 |r,wD:2.1,4.4,(-5.82,.84,;-4.49,.07,;-3.16,.84,;-3.16,2.38,;-1.62,2.38,;-.53,3.47,;.96,3.07,;1.36,4.55,;.56,1.58,;2.45,2.67,;2.85,1.18,;4.33,.78,;5.42,-.31,;5.82,1.18,;-1.62,.84,;-4.49,-1.47,;-5.82,-2.24,;-5.82,-3.78,;-4.49,-4.55,;-3.16,-3.78,;-1.69,-4.26,;-.79,-3.01,;-1.69,-1.77,;-3.16,-2.24,)|
Reactome pathway
US Patent
n/an/a>1.00E+4n/an/an/an/a7.425
Pfizer Inc.
US Patent
Assay Description
Test article and assay controls were added to a 384-well plate. Reaction mixtures contained 20 mM HEPES, pH 7.4, 10 mM magnesium chloride, 0.01% bovi...
US Patent US9035074 (2015)
BindingDB Entry DOI: 10.7270/Q26H4G56
Non-receptor tyrosine-protein kinase TYK2
(Homo sapiens (Human))
BDBM159781
(US10966980, Example 32 | US9035074, 32)
Show SMILES CN([C@@H]1C[C@H](CS(=O)(=O)CCC2CC2)C1)c1ncnc2[nH]ccc12 |r,wD:2.1,4.4,(-5.82,.84,;-4.49,.07,;-3.16,.84,;-3.16,2.38,;-1.62,2.38,;-.53,3.47,;.96,3.07,;1.36,4.55,;.56,1.58,;2.45,2.67,;2.85,1.18,;4.33,.78,;5.42,-.31,;5.82,1.18,;-1.62,.84,;-4.49,-1.47,;-5.82,-2.24,;-5.82,-3.78,;-4.49,-4.55,;-3.16,-3.78,;-1.69,-4.26,;-.79,-3.01,;-1.69,-1.77,;-3.16,-2.24,)|
US Patent
n/an/a 1.46E+3n/an/an/an/an/an/a
Pfizer Inc.
US Patent
Assay Description
Test article and assay controls were added to a 384-well plate. Reaction mixtures contained 20 mM HEPES, pH 7.4, 10 mM magnesium chloride, 0.01% bovi...
US Patent US10966980 (2021)
Tyrosine-protein kinase JAK1
(Homo sapiens (Human))
BDBM159781
(US10966980, Example 32 | US9035074, 32)
Show SMILES CN([C@@H]1C[C@H](CS(=O)(=O)CCC2CC2)C1)c1ncnc2[nH]ccc12 |r,wD:2.1,4.4,(-5.82,.84,;-4.49,.07,;-3.16,.84,;-3.16,2.38,;-1.62,2.38,;-.53,3.47,;.96,3.07,;1.36,4.55,;.56,1.58,;2.45,2.67,;2.85,1.18,;4.33,.78,;5.42,-.31,;5.82,1.18,;-1.62,.84,;-4.49,-1.47,;-5.82,-2.24,;-5.82,-3.78,;-4.49,-4.55,;-3.16,-3.78,;-1.69,-4.26,;-.79,-3.01,;-1.69,-1.77,;-3.16,-2.24,)|
Reactome pathway
US Patent
n/an/a 14n/an/an/an/an/an/a
Pfizer Inc.
US Patent
Assay Description
Test article and assay controls were added to a 384-well plate. Reaction mixtures contained 20 mM HEPES, pH 7.4, 10 mM magnesium chloride, 0.01% bovi...
US Patent US10966980 (2021)
Tyrosine-protein kinase JAK2
(Homo sapiens (Human))
BDBM159781
(US10966980, Example 32 | US9035074, 32)
Show SMILES CN([C@@H]1C[C@H](CS(=O)(=O)CCC2CC2)C1)c1ncnc2[nH]ccc12 |r,wD:2.1,4.4,(-5.82,.84,;-4.49,.07,;-3.16,.84,;-3.16,2.38,;-1.62,2.38,;-.53,3.47,;.96,3.07,;1.36,4.55,;.56,1.58,;2.45,2.67,;2.85,1.18,;4.33,.78,;5.42,-.31,;5.82,1.18,;-1.62,.84,;-4.49,-1.47,;-5.82,-2.24,;-5.82,-3.78,;-4.49,-4.55,;-3.16,-3.78,;-1.69,-4.26,;-.79,-3.01,;-1.69,-1.77,;-3.16,-2.24,)|
Reactome pathway
US Patent
n/an/a 426n/an/an/an/an/an/a
Pfizer Inc.
US Patent
Assay Description
Test article and assay controls were added to a 384-well plate. Reaction mixtures contained 20 mM HEPES, pH 7.4, 10 mM magnesium chloride, 0.01% bovi...
US Patent US10966980 (2021)
Tyrosine-protein kinase JAK3
(Homo sapiens (Human))
BDBM159781
(US10966980, Example 32 | US9035074, 32)
Show SMILES CN([C@@H]1C[C@H](CS(=O)(=O)CCC2CC2)C1)c1ncnc2[nH]ccc12 |r,wD:2.1,4.4,(-5.82,.84,;-4.49,.07,;-3.16,.84,;-3.16,2.38,;-1.62,2.38,;-.53,3.47,;.96,3.07,;1.36,4.55,;.56,1.58,;2.45,2.67,;2.85,1.18,;4.33,.78,;5.42,-.31,;5.82,1.18,;-1.62,.84,;-4.49,-1.47,;-5.82,-2.24,;-5.82,-3.78,;-4.49,-4.55,;-3.16,-3.78,;-1.69,-4.26,;-.79,-3.01,;-1.69,-1.77,;-3.16,-2.24,)|
Reactome pathway
US Patent
n/an/a>1.00E+4n/an/an/an/an/an/a
Pfizer Inc.
US Patent
Assay Description
Test article and assay controls were added to a 384-well plate. Reaction mixtures contained 20 mM HEPES, pH 7.4, 10 mM magnesium chloride, 0.01% bovi...
US Patent US10966980 (2021)
Non-receptor tyrosine-protein kinase TYK2
(Homo sapiens (Human))
BDBM159781
(US10966980, Example 32 | US9035074, 32)
Show SMILES CN([C@@H]1C[C@H](CS(=O)(=O)CCC2CC2)C1)c1ncnc2[nH]ccc12 |r,wD:2.1,4.4,(-5.82,.84,;-4.49,.07,;-3.16,.84,;-3.16,2.38,;-1.62,2.38,;-.53,3.47,;.96,3.07,;1.36,4.55,;.56,1.58,;2.45,2.67,;2.85,1.18,;4.33,.78,;5.42,-.31,;5.82,1.18,;-1.62,.84,;-4.49,-1.47,;-5.82,-2.24,;-5.82,-3.78,;-4.49,-4.55,;-3.16,-3.78,;-1.69,-4.26,;-.79,-3.01,;-1.69,-1.77,;-3.16,-2.24,)|
US Patent
n/an/a 1.46E+3n/an/an/an/a7.425
Pfizer Inc.
US Patent
Assay Description
Test article and assay controls were added to a 384-well plate. Reaction mixtures contained 20 mM HEPES, pH 7.4, 10 mM magnesium chloride, 0.01% bovi...
US Patent US9035074 (2015)
BindingDB Entry DOI: 10.7270/Q26H4G56