null
SMILES: COc1noc2c(F)c3N4C[C@@H](C)O[C@@H](C)[C@@H]4C4(Cc3cc12)C(=O)NC(=O)NC4=O
InChI Key: InChIKey=JTGPFBMJIYJYNZ-CYVIZDSUSA-N
Activity Spreadsheet -- Enzyme Inhibition Constant Data from BindingDB
Found 2 hits for monomerid = 159895
Trg + Lig
Ki
nM
ΔG°
kcal/mole
IC50
nM
Kd
nM
EC50/IC50
nM
koff
s-1
kon
M-1s-1
pHTemp
°C
DNA gyrase subunit A/B
(Escherichia coli (strain K12))
BDBM159895
(US9040528, 51)
Show SMILES COc1noc2c(F)c3N4C[C@@H](C)O[C@@H](C)[C@@H]4C4(Cc3cc12)C(=O)NC(=O)NC4=O |r|
Show InChI InChI=1S/C19H19FN4O6/c1-7-6-24-12-9(4-10-13(11(12)20)30-23-15(10)28-3)5-19(14(24)8(2)29-7)16(25)21-18(27)22-17(19)26/h4,7-8,14H,5-6H2,1-3H3,(H2,21,22,25,26,27)/t7-,8+,14-/m1/s1
n/an/a 970n/an/an/an/an/an/a
AstraZeneca
Curated by ChEMBL
Assay Description
Inhibition of Escherichia coli DNA gyrase using fluorescence-tagged DNA by fluorescenct polarization assay
J Med Chem 57: 9078-95 (2014)
BindingDB Entry DOI: 10.7270/Q2F76FB6
DNA gyrase subunit A/B
(Escherichia coli (strain K12))
BDBM159895
(US9040528, 51)
Show SMILES COc1noc2c(F)c3N4C[C@@H](C)O[C@@H](C)[C@@H]4C4(Cc3cc12)C(=O)NC(=O)NC4=O |r|
Show InChI InChI=1S/C19H19FN4O6/c1-7-6-24-12-9(4-10-13(11(12)20)30-23-15(10)28-3)5-19(14(24)8(2)29-7)16(25)21-18(27)22-17(19)26/h4,7-8,14H,5-6H2,1-3H3,(H2,21,22,25,26,27)/t7-,8+,14-/m1/s1
US Patent
n/an/a 1.00E+3n/an/an/an/a7.5n/a
AstraZeneca AB
US Patent
Assay Description
In a black, 384-well polystyrene assay plate, 30 microliters/well of 5 nM Escherichia coli DNA gyrase A/B tetramer and 130 micrograms/ml of topologic...
US Patent US9040528 (2015)
BindingDB Entry DOI: 10.7270/Q2PG1QG0