BDBM15998 2-({2-[(4-fluorophenyl)amino]pyrimidin-4-yl}amino)benzoic acid::4-anilinopyrimidine 8g
SMILES: OC(=O)c1ccccc1Nc1ccnc(Nc2ccc(F)cc2)n1
InChI Key: InChIKey=DDVYVTJOJSLNBJ-UHFFFAOYSA-N
Data: 1 IC50
Activity Spreadsheet -- Enzyme Inhibition Constant Data from BindingDB
Found 1 hit for monomerid = 15998
Trg + Lig
Ki
nM
ΔG°
kcal/mole
IC50
nM
Kd
nM
EC50/IC50
nM
koff
s-1
kon
M-1s-1
pHTemp
°C
Mitogen-activated protein kinase 8
(Homo sapiens (Human))
BDBM15998
(2-({2-[(4-fluorophenyl)amino]pyrimidin-4-yl}amino)...)
Show SMILES OC(=O)c1ccccc1Nc1ccnc(Nc2ccc(F)cc2)n1
Show InChI InChI=1S/C17H13FN4O2/c18-11-5-7-12(8-6-11)20-17-19-10-9-15(22-17)21-14-4-2-1-3-13(14)16(23)24/h1-10H,(H,23,24)(H2,19,20,21,22)
NCI pathway
Reactome pathway
n/an/a 29n/an/an/an/an/an/a
Abbott Laboratories
Assay Description
In vitro substrate phosphorylation using purified recombinant JNK, was incubated with substrate, and test compounds in the presence of 5uM ATP/ [gamm...
Bioorg Med Chem Lett 17: 668-72 (2007)
Article DOI: 10.1016/j.bmcl.2006.10.093
BindingDB Entry DOI: 10.7270/Q2J964N4