BDBM160047 US9040528, 180
SMILES: C[C@@H]1CN2[C@H]([C@H](C)O1)C1(Cc3cc4c(Cl)noc4c(F)c23)C(=O)NC(=O)NC1=O
InChI Key: InChIKey=XLGIJKUFLIGITI-DDZXGWPLSA-N
Data: 2 IC50
Activity Spreadsheet -- Enzyme Inhibition Constant Data from BindingDB
Found 2 hits for monomerid = 160047
Trg + Lig
Ki
nM
ΔG°
kcal/mole
IC50
nM
Kd
nM
EC50/IC50
nM
koff
s-1
kon
M-1s-1
pHTemp
°C
DNA Gyrase
(Escherichia coli (strain K12))
BDBM160047
(US9040528, 180)
Show SMILES C[C@@H]1CN2[C@H]([C@H](C)O1)C1(Cc3cc4c(Cl)noc4c(F)c23)C(=O)NC(=O)NC1=O |r|
Show InChI InChI=1S/C18H16ClFN4O5/c1-6-5-24-11-8(3-9-12(10(11)20)29-23-14(9)19)4-18(13(24)7(2)28-6)15(25)21-17(27)22-16(18)26/h3,6-7,13H,4-5H2,1-2H3,(H2,21,22,25,26,27)/t6-,7+,13-/m1/s1
n/an/a 210n/an/an/an/an/an/a
AstraZeneca
Curated by ChEMBL
Assay Description
Inhibition of Escherichia coli DNA gyrase using fluorescence-tagged DNA by fluorescenct polarization assay
J Med Chem 57: 9078-95 (2014)
BindingDB Entry DOI: 10.7270/Q2F76FB6
DNA Gyrase
(Escherichia coli (strain K12))
BDBM160047
(US9040528, 180)
Show SMILES C[C@@H]1CN2[C@H]([C@H](C)O1)C1(Cc3cc4c(Cl)noc4c(F)c23)C(=O)NC(=O)NC1=O |r|
Show InChI InChI=1S/C18H16ClFN4O5/c1-6-5-24-11-8(3-9-12(10(11)20)29-23-14(9)19)4-18(13(24)7(2)28-6)15(25)21-17(27)22-16(18)26/h3,6-7,13H,4-5H2,1-2H3,(H2,21,22,25,26,27)/t6-,7+,13-/m1/s1
US Patent
n/an/a 200n/an/an/an/a7.5n/a
AstraZeneca AB
US Patent
Assay Description
In a black, 384-well polystyrene assay plate, 30 microliters/well of 5 nM Escherichia coli DNA gyrase A/B tetramer and 130 micrograms/ml of topologic...
US Patent US9040528 (2015)
BindingDB Entry DOI: 10.7270/Q2PG1QG0