BDBM16019 US8846929, 288
SMILES: [H][C@]12CCC[C@]([H])(C[C@@]([H])(C1)n1c3ccccc3nc(C(O)=O)c1=O)N2C1CCCCCCCCC1
InChI Key: InChIKey=JYWAYLYJDRFBDG-ZBYYUNFXSA-N
Data: 4 KI
Activity Spreadsheet -- Enzyme Inhibition Constant Data from BindingDB
Found 4 hits for monomerid = 16019
Trg + Lig
Ki
nM
ΔG°
kcal/mole
IC50
nM
Kd
nM
EC50/IC50
nM
koff
s-1
kon
M-1s-1
pHTemp
°C
Opioid growth factor receptor-like protein 1
(Homo sapiens (Human))
BDBM16019
(US8846929, 288)
Show SMILES [H][C@]12CCC[C@]([H])(C[C@@]([H])(C1)n1c3ccccc3nc(C(O)=O)c1=O)N2C1CCCCCCCCC1 |r,TLB:11:8:25:2.4.3|
Show InChI InChI=1S/C27H37N3O3/c31-26-25(27(32)33)28-23-15-8-9-16-24(23)30(26)22-17-20-13-10-14-21(18-22)29(20)19-11-6-4-2-1-3-5-7-12-19/h8-9,15-16,19-22H,1-7,10-14,17-18H2,(H,32,33)/t20-,21+,22+
US Patent
1.80n/an/an/an/an/an/a7.4n/a
Purdue Pharma L.P.; Shionogi & Co., Ltd.
US Patent
Assay Description
Radioligand binding assays (screening and dose-displacement) used 0.1nM [3H]-nociceptin (NEN; 87.7 Cl/nimole) with 10-20 ug membrane protein in a fin...
US Patent US8846929 (2014)
BindingDB Entry DOI: 10.7270/Q2G44P04
Kappa-type opioid receptor
(Homo sapiens (Human))
BDBM16019
(US8846929, 288)
Show SMILES [H][C@]12CCC[C@]([H])(C[C@@]([H])(C1)n1c3ccccc3nc(C(O)=O)c1=O)N2C1CCCCCCCCC1 |r,TLB:11:8:25:2.4.3|
Show InChI InChI=1S/C27H37N3O3/c31-26-25(27(32)33)28-23-15-8-9-16-24(23)30(26)22-17-20-13-10-14-21(18-22)29(20)19-11-6-4-2-1-3-5-7-12-19/h8-9,15-16,19-22H,1-7,10-14,17-18H2,(H,32,33)/t20-,21+,22+
Reactome pathway
US Patent
565n/an/an/an/an/an/a7.4n/a
Purdue Pharma L.P.; Shionogi & Co., Ltd.
US Patent
Assay Description
Radioligand dose displacement assays used 0.4-0.8nM [3H]-U69,593 (NEN; 40 Ci/mmole) with 10-20 ug membrane protein (recombinant kappa opioid receptor...
US Patent US8846929 (2014)
BindingDB Entry DOI: 10.7270/Q2G44P04
Mu-type opioid receptor
(Homo sapiens (Human))
BDBM16019
(US8846929, 288)
Show SMILES [H][C@]12CCC[C@]([H])(C[C@@]([H])(C1)n1c3ccccc3nc(C(O)=O)c1=O)N2C1CCCCCCCCC1 |r,TLB:11:8:25:2.4.3|
Show InChI InChI=1S/C27H37N3O3/c31-26-25(27(32)33)28-23-15-8-9-16-24(23)30(26)22-17-20-13-10-14-21(18-22)29(20)19-11-6-4-2-1-3-5-7-12-19/h8-9,15-16,19-22H,1-7,10-14,17-18H2,(H,32,33)/t20-,21+,22+
NCI pathway
Reactome pathway
US Patent
2.06E+3n/an/an/an/an/an/a7.4n/a
Purdue Pharma L.P.; Shionogi & Co., Ltd.
US Patent
Assay Description
Radioligand dose-displacement binding assays for u-opioid receptors used 0.2nM[3H]-diprenorphine (NEN, Boston, Mass.), with 5-20mg membrane protein/w...
US Patent US8846929 (2014)
BindingDB Entry DOI: 10.7270/Q2G44P04
Delta-type opioid receptor
(Homo sapiens (Human))
BDBM16019
(US8846929, 288)
Show SMILES [H][C@]12CCC[C@]([H])(C[C@@]([H])(C1)n1c3ccccc3nc(C(O)=O)c1=O)N2C1CCCCCCCCC1 |r,TLB:11:8:25:2.4.3|
Show InChI InChI=1S/C27H37N3O3/c31-26-25(27(32)33)28-23-15-8-9-16-24(23)30(26)22-17-20-13-10-14-21(18-22)29(20)19-11-6-4-2-1-3-5-7-12-19/h8-9,15-16,19-22H,1-7,10-14,17-18H2,(H,32,33)/t20-,21+,22+
Reactome pathway
US Patent
>2.00E+4n/an/an/an/an/an/a7.4n/a
Purdue Pharma L.P.; Shionogi & Co., Ltd.
US Patent
Assay Description
Radioligand dose-displacement assays used 0.2nM [3H]-Naltrindole (NEN; 33.0 Ci/mmole) with 10-20ug membrane protein (recombinant delta opioid recepto...
US Patent US8846929 (2014)
BindingDB Entry DOI: 10.7270/Q2G44P04