BDBM160341 US9040714, 8::US9693992, 8
SMILES: OC(=O)c1cc2ccc(O)c(C=O)c2oc1=O
InChI Key: InChIKey=AJZZSDQCOLIURJ-UHFFFAOYSA-N
Data: 2 IC50  1 EC50
Activity Spreadsheet -- Enzyme Inhibition Constant Data from BindingDB
Found 2 hits for monomerid = 160341
Trg + Lig
Ki
nM
ΔG°
kcal/mole
IC50
nM
Kd
nM
EC50/IC50
nM
koff
s-1
kon
M-1s-1
pHTemp
°C
Serine/threonine-protein kinase/endoribonuclease IRE1 Alpha
(Homo sapiens (Human))
BDBM160341
(US9040714, 8 | US9693992, 8)
Show SMILES OC(=O)c1cc2ccc(O)c(C=O)c2oc1=O
Show InChI InChI=1S/C11H6O6/c12-4-7-8(13)2-1-5-3-6(10(14)15)11(16)17-9(5)7/h1-4,13H,(H,14,15)
Reactome pathway
US Patent
n/an/a>1.00E+4n/a>1.00E+4n/an/a7.530
MannKind Corporation
US Patent
Assay Description
A fusion protein comprising glutathione S transferase (GST) and human IRE-1α (GST-IRE-1α) obtained from a 500 ml baculovirus-infected ins...
US Patent US9693992 (2017)
BindingDB Entry DOI: 10.7270/Q2CZ35BC
Serine/threonine-protein kinase/endoribonuclease IRE1 Alpha
(Homo sapiens (Human))
BDBM160341
(US9040714, 8 | US9693992, 8)
Show SMILES OC(=O)c1cc2ccc(O)c(C=O)c2oc1=O
Show InChI InChI=1S/C11H6O6/c12-4-7-8(13)2-1-5-3-6(10(14)15)11(16)17-9(5)7/h1-4,13H,(H,14,15)
Reactome pathway
US Patent
n/an/a>1.00E+4n/an/an/an/a7.5n/a
MannKind Corporation
US Patent
Assay Description
A fusion protein comprising glutathione S transferase (GST) and human IRE-1alpha (GST-IRE-1alpha) obtained from a 500 ml baculovirus-infected insect ...
US Patent US9040714 (2015)
BindingDB Entry DOI: 10.7270/Q2S75F3S