null
SMILES: CN(C)C(=O)c1cccc(c1)-c1c(C)c2ccc(O)c(C=O)c2oc1=O
InChI Key: InChIKey=RKKMQUQMJJZLKP-UHFFFAOYSA-N
Activity Spreadsheet -- Enzyme Inhibition Constant Data from BindingDB
Found 2 hits for monomerid = 160352
Trg + Lig
Ki
nM
ΔG°
kcal/mole
IC50
nM
Kd
nM
EC50/IC50
nM
koff
s-1
kon
M-1s-1
pHTemp
°C
Serine/threonine-protein kinase/endoribonuclease IRE1
(Homo sapiens (Human))
BDBM160352
(US9040714, 20 | US9693992, 20)
Show SMILES CN(C)C(=O)c1cccc(c1)-c1c(C)c2ccc(O)c(C=O)c2oc1=O
Show InChI InChI=1S/C20H17NO5/c1-11-14-7-8-16(23)15(10-22)18(14)26-20(25)17(11)12-5-4-6-13(9-12)19(24)21(2)3/h4-10,23H,1-3H3
Reactome pathway
US Patent
n/an/a<1.00E+3n/a>1.00E+4n/an/a7.530
MannKind Corporation
US Patent
Assay Description
A fusion protein comprising glutathione S transferase (GST) and human IRE-1α (GST-IRE-1α) obtained from a 500 ml baculovirus-infected ins...
US Patent US9693992 (2017)
BindingDB Entry DOI: 10.7270/Q2CZ35BC
Serine/threonine-protein kinase/endoribonuclease IRE1
(Homo sapiens (Human))
BDBM160352
(US9040714, 20 | US9693992, 20)
Show SMILES CN(C)C(=O)c1cccc(c1)-c1c(C)c2ccc(O)c(C=O)c2oc1=O
Show InChI InChI=1S/C20H17NO5/c1-11-14-7-8-16(23)15(10-22)18(14)26-20(25)17(11)12-5-4-6-13(9-12)19(24)21(2)3/h4-10,23H,1-3H3
Reactome pathway
US Patent
n/an/a<1.00E+3n/an/an/an/a7.5n/a
MannKind Corporation
US Patent
Assay Description
A fusion protein comprising glutathione S transferase (GST) and human IRE-1alpha (GST-IRE-1alpha) obtained from a 500 ml baculovirus-infected insect ...
US Patent US9040714 (2015)
BindingDB Entry DOI: 10.7270/Q2S75F3S