BDBM160358 US9040714, 26::US9693992, 26
SMILES: COc1cc2c(C)c(-c3ccc(cc3)C(=O)N3CCOCC3)c(=O)oc2c(C=O)c1O
InChI Key: InChIKey=BBLPZQACOXLBBI-UHFFFAOYSA-N
Data: 2 IC50  1 EC50
Activity Spreadsheet -- Enzyme Inhibition Constant Data from BindingDB
Found 2 hits for monomerid = 160358
Trg + Lig
Ki
nM
ΔG°
kcal/mole
IC50
nM
Kd
nM
EC50/IC50
nM
koff
s-1
kon
M-1s-1
pHTemp
°C
Serine/threonine-protein kinase/endoribonuclease IRE1
(Homo sapiens (Human))
BDBM160358
(US9040714, 26 | US9693992, 26)
Show SMILES COc1cc2c(C)c(-c3ccc(cc3)C(=O)N3CCOCC3)c(=O)oc2c(C=O)c1O
Show InChI InChI=1S/C23H21NO7/c1-13-16-11-18(29-2)20(26)17(12-25)21(16)31-23(28)19(13)14-3-5-15(6-4-14)22(27)24-7-9-30-10-8-24/h3-6,11-12,26H,7-10H2,1-2H3
Reactome pathway
US Patent
n/an/a<1.00E+3n/a<1.00E+4n/an/a7.530
MannKind Corporation
US Patent
Assay Description
A fusion protein comprising glutathione S transferase (GST) and human IRE-1α (GST-IRE-1α) obtained from a 500 ml baculovirus-infected ins...
US Patent US9693992 (2017)
BindingDB Entry DOI: 10.7270/Q2CZ35BC
Serine/threonine-protein kinase/endoribonuclease IRE1
(Homo sapiens (Human))
BDBM160358
(US9040714, 26 | US9693992, 26)
Show SMILES COc1cc2c(C)c(-c3ccc(cc3)C(=O)N3CCOCC3)c(=O)oc2c(C=O)c1O
Show InChI InChI=1S/C23H21NO7/c1-13-16-11-18(29-2)20(26)17(12-25)21(16)31-23(28)19(13)14-3-5-15(6-4-14)22(27)24-7-9-30-10-8-24/h3-6,11-12,26H,7-10H2,1-2H3
Reactome pathway
US Patent
n/an/a<1.00E+3n/an/an/an/a7.5n/a
MannKind Corporation
US Patent
Assay Description
A fusion protein comprising glutathione S transferase (GST) and human IRE-1alpha (GST-IRE-1alpha) obtained from a 500 ml baculovirus-infected insect ...
US Patent US9040714 (2015)
BindingDB Entry DOI: 10.7270/Q2S75F3S