null
SMILES: Cc1nc(sc1C(=O)NC1CCNCC1)N1CCc2c(C1)ccc(O)c2C=O
InChI Key: InChIKey=RQEVNFOOCLYSJU-UHFFFAOYSA-N
Activity Spreadsheet -- Enzyme Inhibition Constant Data from BindingDB
Found 2 hits for monomerid = 160367
Trg + Lig
Ki
nM
ΔG°
kcal/mole
IC50
nM
Kd
nM
EC50/IC50
nM
koff
s-1
kon
M-1s-1
pHTemp
°C
Serine/threonine-protein kinase/endoribonuclease IRE1
(Homo sapiens (Human))
BDBM160367
(US9040714, 35 | US9693992, 35)
Show SMILES Cc1nc(sc1C(=O)NC1CCNCC1)N1CCc2c(C1)ccc(O)c2C=O
Show InChI InChI=1S/C20H24N4O3S/c1-12-18(19(27)23-14-4-7-21-8-5-14)28-20(22-12)24-9-6-15-13(10-24)2-3-17(26)16(15)11-25/h2-3,11,14,21,26H,4-10H2,1H3,(H,23,27)
Reactome pathway
US Patent
n/an/a<100n/a>1.00E+4n/an/a7.530
MannKind Corporation
US Patent
Assay Description
A fusion protein comprising glutathione S transferase (GST) and human IRE-1α (GST-IRE-1α) obtained from a 500 ml baculovirus-infected ins...
US Patent US9693992 (2017)
BindingDB Entry DOI: 10.7270/Q2CZ35BC
Serine/threonine-protein kinase/endoribonuclease IRE1
(Homo sapiens (Human))
BDBM160367
(US9040714, 35 | US9693992, 35)
Show SMILES Cc1nc(sc1C(=O)NC1CCNCC1)N1CCc2c(C1)ccc(O)c2C=O
Show InChI InChI=1S/C20H24N4O3S/c1-12-18(19(27)23-14-4-7-21-8-5-14)28-20(22-12)24-9-6-15-13(10-24)2-3-17(26)16(15)11-25/h2-3,11,14,21,26H,4-10H2,1H3,(H,23,27)
Reactome pathway
US Patent
n/an/a<100n/an/an/an/a7.5n/a
MannKind Corporation
US Patent
Assay Description
A fusion protein comprising glutathione S transferase (GST) and human IRE-1alpha (GST-IRE-1alpha) obtained from a 500 ml baculovirus-infected insect ...
US Patent US9040714 (2015)
BindingDB Entry DOI: 10.7270/Q2S75F3S