null
SMILES: OC(=O)c1ccc(NC(=O)c2cc(Cl)c(Cl)cc2Oc2ccc(OCC(F)(F)F)cc2)cc1
InChI Key: InChIKey=DZORGHOZKZHPLX-UHFFFAOYSA-N
Activity Spreadsheet -- Enzyme Inhibition Constant Data from BindingDB
Found 1 hit for monomerid = 160952
Trg + Lig
Ki
nM
ΔG°
kcal/mole
IC50
nM
Kd
nM
EC50/IC50
nM
koff
s-1
kon
M-1s-1
pHTemp
°C
Sodium channel protein type 10 subunit alpha
(Rattus norvegicus (Rat))
BDBM160952
(US9108903, 17)
Show SMILES OC(=O)c1ccc(NC(=O)c2cc(Cl)c(Cl)cc2Oc2ccc(OCC(F)(F)F)cc2)cc1
Show InChI InChI=1S/C22H14Cl2F3NO5/c23-17-9-16(20(29)28-13-3-1-12(2-4-13)21(30)31)19(10-18(17)24)33-15-7-5-14(6-8-15)32-11-22(25,26)27/h1-10H,11H2,(H,28,29)(H,30,31)
US Patent
n/an/a 62n/an/an/an/an/an/a
VERTEX PHARMACEUTICALS INCORPORATED
US Patent
Assay Description
Patch clamp electrophysiology was used to assess the efficacy and selectivity of sodium channel blockers in dorsal root ganglion neurons. Rat neurons...
US Patent US9108903 (2015)
BindingDB Entry DOI: 10.7270/Q23J3BP9